{"text_format":"1","workbook":"xlsx","n_sheets":11,"sheets":["User Input","Lists","Heating Load","Adjusted HSPF","AppTech","Factors","Residential Prices","Calc","Carbon Calculator","Profiles","Methodology"],"not_rendered":{"charts":6,"images":2,"macros":0,"external_links":0,"defined_names":45,"comments":3,"pivot_tables":0},"unopened":[],"bounds":{"document_bytes":16777216,"sheet_cells":100000,"rows_first":2000,"rows_last":500,"rows_between":2000,"halvings":0,"cell_chars":16384,"cell_head_chars":4096},"cells_cut":0,"cells_raw":0,"read":"whole","date_system":"1900"}

{"sheet":"User Input","index":0,"n_rows":95,"n_cols":15,"rows_kept":95,"cut":false,"hidden":false,"merged":[[12,5,12,6],[66,11,66,13]]}
[]
[]
[null,null,null,"Residential Energy Cost & Emissions Calculator"]
[]
[null,null,null,null,"State/Province",1,null,null,"Includes eGrid 2025 update (2023 data)"]
[]
[null,null,null,null,"City (for U.S. states)",1]
[]
[null,null,null,null,"Central Station Emissions Profile",2,null,null,{"$f":"IFERROR(_xlfn.IFS(AND(state<53,emisProfile=3),\"Central Station Emissions Profile does not match.\",AND(state>52,emisProfile<3),\"Central Station Emissions Profile does not match.\"),\"\")","v":""}]
[]
[null,null,null,null,"Fuel and Electric Prices",1,null,null,1,null,null,1,null,1]
[]
[null,null,null,null,null,"Natural Gas Price",null,null,"Electricity Price",null,null,"Oil Price",null,"Propane Price"]
[null,null,null,null,{"$f":"IF(OR(NGrates=1,Erates=1,Orates=1,Prates=1),\"Default Energy Rates\",\"\")","v":"Default Energy Rates"},{"$f":"IF(NGrates=1,Calc!B117,\"\")","v":14.83},{"$f":"IF(NGrates=1,\"$/MMBtu\",\"\")","v":"$/MMBtu"},null,{"$f":"IF(Erates=1,Calc!B116,\"\")","v":16},{"$f":"IF(Erates=1,\"cents/kWh\",\"\")","v":"cents/kWh"},null,{"$f":"IF(Orates=1,Calc!B118,\"\")","v":4.28},{"$f":"IF(Orates=1,\"$/gal\",\"\")","v":"$/gal"},{"$f":"IF(Prates=1,Calc!B119,\"\")","v":2.56},{"$f":"IF(Prates=1,\"$/gal\",\"\")","v":"$/gal"}]
[null,null,null,null,{"$f":"IF(OR(NGrates=2,Erates=2,Orates=2,Prates=2),\"User Input Energy Rates\",\"\")","v":""},14.1,{"$f":"IF(NGrates=2,\"$/MMBtu\",\"\")","v":""},null,17,{"$f":"IF(Erates=2,\"cents/kWh\",\"\")","v":""},null,4.0999999999999996,{"$f":"IF(Orates=2,\"$/gal\",\"\")","v":""},3,{"$f":"IF(Prates=2,\"$/gal\",\"\")","v":""}]
[]
[]
[null,null,null,"Space Heating System"]
[]
[null,null,null,null,"Square Footage of House (between 0 and 6,000 sqft)",2000,"sqft"]
[]
[null,null,null,null,"Energy Source for Current Heating System",1]
[null,null,null,null,{"$f":"IFERROR(_xlfn.IFS(AND(heattype=1,$F$24>4),\"Please select a heating system type.\",AND(heattype=2,$F$24>5),\"Please select a heating system type.\"),\"\")","v":""}]
[null,null,null,null,{"$f":"\"Current \" & _xlfn.XLOOKUP(F22,Lists!G4:G7,Lists!H4:H7)&\" Heating System Type\"","v":"Current Electric Heating System Type"},2]
[]
[null,null,null,null,"Annual Space Heating Requirements",{"$f":"TEXT(Calc!B9,\"0.0\")&\" MMBtu/yr\"","v":"49.6 MMBtu/yr"}]
[]
[null,null,null,null,"Type of Natural Gas Heating System To Compare ",1]
[]
[]
[null,null,null,"Water Heating"]
[]
[null,null,null,null,"Family Size",3]
[]
[null,null,null,null,"Type of Current Water Heating System",1]
[null,null,null,null,{"$f":"IFERROR(_xlfn.IFS(AND(wheattype=1,$F$37>4),\"Please select a water heating system type.\",AND(wheattype=2,$F$37>2),\"Please select a water heating system type.\"),\"\")","v":""}]
[null,null,null,null,{"$f":"\"Current \" & _xlfn.XLOOKUP(F35,Lists!G4:G7,Lists!H4:H7)&\" Water Heating System Type\"","v":"Current Electric Water Heating System Type"},1]
[]
[null,null,null,null,"Annual Water Heating Requirements",{"$f":"Calc!B30","v":13.99629},"MMBtu/yr"]
[]
[null,null,null,null,"Type of Natural Gas Water Heating System To Compare",1]
[]
[null,null,null,"Clothes Dryer"]
[]
[null,null,null,null,"Type of Current Dryer",1]
[]
[null,null,null,null,"Loads per Week (national standard is 8 loads/week)",7]
[]
[null,null,null,null,"Annual Dryer Heating Requriements",{"$f":"Calc!B48","v":3.2560958801498128},"MMBtu/yr"]
[]
[null,null,null,null,{"$f":"\"Standard Efficiency - \"&_xlfn.XLOOKUP(F45,Lists!I4:I6,Lists!J4:J6) &\" Dryer (7lb load)\"","v":"Standard Efficiency - Electric Dryer (7lb load)"},{"$f":"IF(dtype=1,3.73,3.3)","v":3.73},"CEF"]
[]
[]
[null,null,null,"Cooking"]
[]
[null,null,null,null,"Prepare meals on a range, cook top or oven","Yes"]
[]
[null,null,null,null,"Type of Current System",1]
[]
[null,null,null,null,{"$f":"IF(ctype=1,\"Annual Cooking Electric Requirements\",\"Annual Cooking Heating Requirements\")","v":"Annual Cooking Electric Requirements"},{"$f":"IF(ctype=1,261,1.5)","v":261},{"$f":"IF(ctype=1,\"kWh/yr\",\"MMBtu/yr\")","v":"kWh/yr"}]
[]
[null,null,null,null,{"$f":"\"Standard Efficiency \"&_xlfn.XLOOKUP(F58,Lists!I4:I6,Lists!J4:J6)&\" Range\"","v":"Standard Efficiency Electric Range"},{"$f":"IF(ctype=1,0.74,0.4)","v":0.74}]
[]
[]
[]
[]
[null,null,null,"Results",null,"Current Home",null,null,"Proposed Gas Home",null,null,"Savings with Natural Gas"]
[null,null,null,null,null,"$/Year",null,null,"$/Year",null,null,"$/Year",null,"Percentage"]
[null,null,null,null,"Energy Spending","Consumed at House",null,null,"Consumed at House",null,null,"Savings  ",null,"Of current spending"]
[null,null,null,null,"Space Heating",{"$f":"Calc!G133","v":1180.4986249360509},null,null,{"$f":"Calc!H133","v":920.1760681760959},null,null,{"$f":"F70-I70","v":260.32255675995498},null,{"$f":"IF(L70=0,0,L70/F70)","v":0.2205191528910565}]
[]
[null,null,null,null,"Water Heating",{"$f":"Calc!G134","v":713.40486263316166},null,null,{"$f":"Calc!H134","v":357.87065637931033},null,null,{"$f":"F72-I72","v":355.53420625385132},null,{"$f":"IF(L72=0,0,L72/F72)","v":0.49836246551724134}]
[]
[null,null,null,null,"Clothes Dryer",{"$f":"Calc!G135","v":109.29758713136729},null,null,{"$f":"Calc!H135","v":48.287901902621726},null,null,{"$f":"F74-I74","v":61.009685228745568},null,{"$f":"IF(L74=0,0,L74/F74)","v":0.55819791479400749}]
[]
[null,null,null,null,"Cooking",{"$f":"Calc!G136","v":56.432432432432435},null,null,{"$f":"Calc!H136","v":22.245000000000001},null,null,{"$f":"F76-I76","v":34.187432432432431},null,{"$f":"IF(L76=0,0,L76/F76)","v":0.60581178160919535}]
[]
[]
[null,null,null,null,"Total House Appliances",{"$f":"Calc!G137","v":2059.6335071330122},null,null,{"$f":"Calc!H137","v":1348.5796264580279},null,null,{"$f":"F79-I79","v":711.05388067498438},null,{"$f":"IF(L79=0,0,L79/F79)","v":0.3452332068848325}]
[]
[]
[]
[null,null,null,null,"Emissions","lbs/Year",null,null,"lbs/Year",null,null,"lbs/Year",null,"Percentage"]
[null,null,null,null,null,"Emmited",null,null,"Emmited",null,null,"Savings",null,"Of current emissions"]
[null,null,null,null,"NOx  -  lbs / Year",{"$f":"'Carbon Calculator'!E132","v":9.6511337781443931},null,null,{"$f":"'Carbon Calculator'!I132","v":11.223354273464889},null,null,{"$f":"F85-I85","v":-1.5722204953204955},null,{"$f":"L85/F85","v":-0.16290526392669935}]
[]
[null,null,null,null,"SOx  -  lbs / Year",{"$f":"'Carbon Calculator'!E131","v":7.7073138763491134},null,null,{"$f":"'Carbon Calculator'!I131","v":5.3491714983857366E-2},null,null,{"$f":"F87-I87","v":7.6538221613652562},null,{"$f":"L87/F87","v":0.99305961637970874}]
[]
[null,null,null,null,"CO2  -  lbs / Year",{"$f":"'Carbon Calculator'!E130","v":17266.816256185801},null,null,{"$f":"'Carbon Calculator'!I130","v":10698.342996771473},null,null,{"$f":"F89-I89","v":6568.4732594143279},null,{"$f":"L89/F89","v":0.38041021355405841}]
[]
[]
[null,null,null,null,"Yes"]
[null,null,null,null,"No",null,"CO2 Reduction",{"$f":"IF(Calc!B104>0,Calc!B104,\"n/a\")","v":7448.5998133610728},"miles driven by a gasoline-powered passenger vehicle"]
[null,null,null,null,null,null,"Equivalent to: "]
[null,null,null,null,null,null,null,{"$f":"IF(Calc!B102>0,Calc!B102,\"n/a\")","v":2.9794399253444288},"Acres of forest removing CO2 from the Air"]

{"sheet":"Lists","index":1,"n_rows":358,"n_cols":13,"rows_kept":358,"cut":false,"hidden":false,"merged":[[117,8,117,9]]}
["Pick list lookups",null,null,null,null,null,null,"*lists below update based on fuel type"]
[]
["A1","Furnace technology",null,null,null,null,null,"Type of Heating System to Compare",null,"Dryer/Cooking Types"]
[1,"Average Furnace (AFUE 80%)",0.8,null,null,null,1,"Electric",1,"Electric"]
[2,"High Efficiency Furnace (AFUE 92%)",0.92,null,null,null,2,"Oil",2,"Propane"]
[3,"Ultra High Effic. Furnace (AFUE 97%)",0.97,null,null,null,3,"Propane",3,"Gas"]
[4,"Standard Boiler (AFUE 82%)",0.82,null,null,null,4,"Gas"]
[5,"Condensing Boiler (AFUE 92%)",0.92,null,null,null,"Space",{"$f":"CHOOSE(heattype, \"Electric\", \"Oil\", \"Propane\", \"Gas\")","v":"Electric"}]
[6,"Wall Hung Boiler (AFUE 96%)",0.96,null,null,null,"Water",{"$f":"CHOOSE(wheattype, \"Electric\", \"Oil\", \"Propane\", \"Gas\")","v":"Electric"}]
[7,"Gas Heat Pump (COP 1.4)",1.4,null,null,null,null," "]
["B8","Egrid profile",null,null,null,null,{"$f":"\"Space \"&H8& \" System\"","v":"Space Electric System"},{"$f":"IFERROR(INDEX(CHOOSE(heattype, $B$87:$B$90, $H$87:$H$91, $L$87:$L$93, $B$4:$B$10), ROW(1:1)), \"\")","v":"Electric Furnace/Strip Heat - 99% AFUE"}]
[1,"eGRID Average All Sources 2010",null,null,null,null,null,{"$f":"IFERROR(INDEX(CHOOSE(heattype, $B$87:$B$90, $H$87:$H$91, $L$87:$L$93, $B$4:$B$10), ROW(2:2)), \"\")","v":"Standard Effic. Heat Pump - 7.5 HSPF2"}]
[2,"eGRID Average Fossil 2010",null,null,null,null,null,{"$f":"IFERROR(INDEX(CHOOSE(heattype, $B$87:$B$90, $H$87:$H$91, $L$87:$L$93, $B$4:$B$10), ROW(3:3)), \"\")","v":"Energy Star Heat Pump - 7.8 HSPF2"}]
[3,"Canadian Average All Sources 2011","*not used for calculations",null,null,null,null,{"$f":"IFERROR(INDEX(CHOOSE(heattype, $B$87:$B$90, $H$87:$H$91, $L$87:$L$93, $B$4:$B$10), ROW(4:4)), \"\")","v":"High Efficiency Heat Pump - 9 HSPF2"}]
[4,null,null,null,null,null,null,{"$f":"IFERROR(INDEX(CHOOSE(heattype, $B$87:$B$89, $H$87:$H$91, $L$87:$L$93, $B$4:$B$10), ROW(5:5)), \"\")","v":""}]
[5,null,null,null,null,null,null,{"$f":"IFERROR(INDEX(CHOOSE(heattype, $B$87:$B$89, $H$87:$H$91, $L$87:$L$93, $B$4:$B$10), ROW(6:6)), \"\")","v":""}]
[null,null,null,null,null,null,null,{"$f":"IFERROR(INDEX(CHOOSE(heattype, $B$87:$B$89, $H$87:$H$91, $L$87:$L$93, $B$4:$B$10), ROW(7:7)), \"\")","v":""}]
[null,null,null,null,null,null,{"$f":"\"Water \"&H9& \" System\"","v":"Water Electric System"},{"$f":"IFERROR(INDEX(CHOOSE(wheattype,$B$104:$B$107,$H$96:$H$97,$L$96:$L$103, $B$94:$B$101), ROW(1:1)), \"\")","v":"Standard: UEF = 0.92"}]
[null,null,null,null,null,null,null,{"$f":"IFERROR(INDEX(CHOOSE(wheattype,$B$104:$B$107,$H$96:$H$97,$L$96:$L$103, $B$94:$B$101), ROW(2:2)), \"\")","v":"High-Performing: UEF = 0.93"}]
["B6","State",null,"Census Region","Regional Factor",null,null,{"$f":"IFERROR(INDEX(CHOOSE(wheattype,$B$104:$B$107,$H$96:$H$97,$L$96:$L$103, $B$94:$B$101), ROW(3:3)), \"\")","v":"Whole Home Electric Tankless:UE = .91"}]
[1,"US Average","US","US",1,{"$f":"A21","v":1},null,{"$f":"IFERROR(INDEX(CHOOSE(wheattype,$B$104:$B$107,$H$96:$H$97,$L$96:$L$103, $B$94:$B$101), ROW(4:4)), \"\")","v":"Elec. Heat Pump Water Heater:UEF=3.0"}]
[2,"Alaska","AK","Pacific",1,{"$f":"A22","v":2},null,{"$f":"IFERROR(INDEX(CHOOSE(wheattype,$B$104:$B$107,$H$96:$H$97,$L$96:$L$103, $B$94:$B$101), ROW(5:5)), \"\")","v":""}]
[3,"Alabama","AL","East South Central",0.92,3,null,{"$f":"IFERROR(INDEX(CHOOSE(wheattype,$B$104:$B$107,$H$96:$H$97,$L$96:$L$103, $B$94:$B$101), ROW(6:6)), \"\")","v":""}]
[4,"Arkansas","AR","West South Central",0.88,4,null,{"$f":"IFERROR(INDEX(CHOOSE(wheattype,$B$104:$B$107,$H$96:$H$97,$L$96:$L$103, $B$94:$B$101), ROW(7:7)), \"\")","v":""}]
[5,"Arizona","AZ","Mountain",0.82,5,null,{"$f":"IFERROR(INDEX(CHOOSE(wheattype,$B$104:$B$107,$H$96:$H$97,$L$96:$L$103, $B$94:$B$101), ROW(8:8)), \"\")","v":""}]
[6,"California","CA","Pacific",0.75,6]
[7,"Colorado","CO","Mountain",0.82,7]
[8,"Connecticut","CT","New England",1.1000000000000001,8]
[9,"District of Columbia","DC","South Atlantic",0.75,9]
[10,"Delaware","DE","South Atlantic",0.75,10]
[11,"Florida","FL","South Atlantic",0.75,11]
[12,"Georgia","GA","South Atlantic",0.75,12]
[13,"Hawaii","HI","Pacific",0.75,13]
[14,"Iowa","IA","West North Central",1.06,14]
[15,"Idaho","ID","Mountain",0.82,15]
[16,"Illinois","IL","East North Central",1.03,16]
[17,"Indiana","IN","East North Central",1.03,17]
[18,"Kansas","KS","West North Central",1.06,18]
[19,"Kentucky","KY","East South Central",0.92,19]
[20,"Louisiana","LA","West South Central",0.88,20]
[21,"Massachusetts","MA","New England",1.1000000000000001,21]
[22,"Maryland","MD","South Atlantic",0.75,22]
[23,"Maine","ME","New England",1.1000000000000001,23]
[24,"Michigan","MI","East North Central",1.03,24]
[25,"Minnesota","MN","West North Central",1.06,25]
[26,"Missouri","MO","West North Central",1.06,26]
[27,"Mississippi","MS","East South Central",0.92,27]
[28,"Montana","MT","Mountain",0.82,28]
[29,"North Carolina","NC","South Atlantic",0.75,29]
[30,"North Dakota","ND","West North Central",1.06,30]
[31,"Nebraska","NE","West North Central",1.06,31]
[32,"New Hampshire","NH","New England",1.1000000000000001,32]
[33,"New Jersey","NJ","Middle Atlantic",1.24,33]
[34,"New Mexico","NM","Mountain",0.82,34]
[35,"Nevada","NV","Mountain",0.82,35]
[36,"New York","NY","Middle Atlantic",1.24,36]
[37,"Ohio","OH","East North Central",1.03,37]
[38,"Oklahoma","OK","West South Central",0.88,38]
[39,"Oregon","OR","Pacific",0.75,39]
[40,"Pennsylvania","PA","Middle Atlantic",1.24,40]
[41,"Rhode Island","RI","New England",1.1000000000000001,41]
[42,"South Carolina","SC","South Atlantic",0.75,42]
[43,"South Dakota","SD","West North Central",1.06,43]
[44,"Tennessee","TN","East South Central",0.92,44]
[45,"Texas","TX","West South Central",0.88,45]
[46,"Utah","UT","Mountain",0.82,46]
[47,"Virginia","VA","South Atlantic",0.75,47]
[48,"Vermont","VT","New England",1.1000000000000001,48]
[49,"Washington","WA","Pacific",0.75,49]
[50,"Wisconsin","WI","East North Central",1.03,50]
[51,"West Virginia","WV","South Atlantic",0.75,51]
[52,"Wyoming","WY","Mountain",0.82,52]
[53,"Canadian Average","Canada Avg.","East North Central",1.03,53]
[54,"Alberta","AB","East North Central",1.03,54]
[55,"British Columbia","BC","East North Central",1.03,55]
[56,"Manitoba","MB","East North Central",1.03,56]
[57,"New Brunswick","NB","East North Central",1.03,57]
[58,"Newfoundland","NF","East North Central",1.03,58]
[59,"Nova Scotia","NS","East North Central",1.03,59]
[60,"Ontario","ON","East North Central",1.03,60]
[61,"Prince Edward Island","PE","East North Central",1.03,61]
[62,"Quebec","QB","East North Central",1.03,62]
[63,"Saskatchewan","SK","East North Central",1.03,63]
[]
[]
["H3","What is the Efficiency of the Electric Heating System that is Being Displaced?",null,null,null,null,null,"What is the Efficiency of the Oil Heating System that is Being Displaced?",null,null,null,"What is the Efficiency of the Propane Heating System that is Being Displaced?"]
[1,"Electric Furnace/Strip Heat - 99% AFUE",null,null,null,null,1,"Furnace ,non-weatherized (78% AFUE)",0.78,null,1,"Average Furnace (AFUE 80%)",0.8]
[2,"Standard Effic. Heat Pump - 7.5 HSPF2",null,"http://www.rheem.com/products/heating_and_cooling/heat_pumps/",null,null,2,"Avg furnace, after 5/1/13 (83% AFUE)",0.83,null,2,"High Efficiency Furnace (AFUE 92%)",0.92]
[3,"Energy Star Heat Pump - 7.8 HSPF2",null,null,null,null,3,"HE Furnace (85% AFUE)",0.85,null,3,"Ultra High Effic. Furnace (AFUE 97%)",0.97]
[4,"High Efficiency Heat Pump - 9 HSPF2",null,"http://www.horizonservicesinc.com/reference/tips-articles/ratings-explained","http://www.lennox.com/products/heat-pumps/XP13/","http://www.lennox.com/products/heat-pumps/XP25/",4,"Standard boiler  (84% AFUE) ",0.84,null,4,"Standard Boiler (AFUE 82%)",0.82]
[null,null,null,null,null,null,5,"Condensing boiler(92.8% AFUE)",0.92800000000000005,null,5,"Condensing Boiler (AFUE 92%)",0.92]
[null,null,null,null,null,null,null,null,null,null,6,"Wall Hung Boiler (AFUE 96%)",0.96]
["C1","Natural Gas Water Heater Energy Factor","UEF",null,null,null,null,null,null,null,7,"Gas Heat Pump (COP 1.4)",1.4]
[1,"Standard Tank: UEF = .58",0.57999999999999996]
[2,"High Performing Tank: UEF = 0.68",0.68,null,"https://www.aosmithatlowes.com/products/water-heaters/gas-water-heaters/g12-cadt4040nv/",null," ","Oil Water Heater Energy Factor","UEF",null,null,"Propane Water Heater Energy Factor","UEF"]
[3,"Power Vent Tank: UEF = .70",0.7,null,"https://www.aosmithatlowes.com/products/water-heaters/gas-water-heaters/g6-pvt4050pv/",null,1,"Standard Tank: UEF = .54",0.54,null,1,"Standard Tank: UEF = .58",0.57999999999999996]
[4,"Direct Vent: UEF = 0.60",0.6,null,"https://www.aosmithatlowes.com/products/water-heaters/gas-water-heaters/g6-dvs4038nvl/",null,2,"High Efficiency Tank = .64",0.64,null,2,"High Performing Tank: UEF = 0.68",0.68]
[5,"Condensing Tank: UEF = 0.9",0.9,null,"https://www.aosmithatlowes.com/products/water-heaters/gas-water-heaters/gc9-ps4050nv/",null," ",null,null,null,3,"Power Vent Tank: UEF = .70",0.7]
[6,"Tankless: UEF = 0.81",0.81,null,"https://www.aosmithatlowes.com/products/water-heaters/gas-tankless/gt15-510c-i/",null," ",null,null,null,4,"Direct Vent: UEF = 0.60",0.6]
[7,"Condensing Tankless: UEF = 0.95",0.95,null,"https://www.aosmithatlowes.com/products/water-heaters/gas-tankless/gt15thr-199x3/",null," ",null,null,null,5,"Condensing Tank: UEF = 0.9",0.9]
[8,"Gas Heat Pump: COP = 1.4",1.4,null,null,null,null,null,null,null,6,"Tankless: UEF = 0.81",0.81]
[null,null,null,null,null,null,null,null,null,null,7,"Condensing Tankless: UEF = 0.95",0.95]
["C2","Electric Water Heater Enegy Factor","UEF",null,null,null,null,null,null,null,8,"Gas Heat Pump: COP = 1.4",1.4]
[1,"Standard: UEF = 0.92",0.92,null,"https://www.aosmithatlowes.com/products/water-heaters/electric-water-heaters/e6-40r38d-ttp/",null,null," "]
[2,"High-Performing: UEF = 0.93",0.93,null,"https://www.aosmithatlowes.com/products/water-heaters/electric-water-heaters/eea12-40r55dvf/",null,null," "]
[3,"Whole Home Electric Tankless:UE = .91",0.91,null,"https://www.aosmithatlowes.com/products/water-heaters/electric-tankless/r4mr-320e/",null,null," "]
[4,"Elec. Heat Pump Water Heater:UEF=3.0",3,null,"https://www.aosmithatlowes.com/products/water-heaters/electric-water-heaters/hpv10-80h01dv/",null,null," "]
[]
["C3","Natural Gas Dryer Energy Factor"]
[1,"Standard Dryer (7lb load): CEF = 3.3"]
[]
["C4","Electric Dryer Energy Factor"]
[1,"Standard Dryer (7lb load): CEF = 3.73"]
[]
[1,"Use default NG rates",1,"Use default electric rates",null,1,"Use default oil rates",1,"Use default propane rates"]
[2,"Enter my own NG rates",2,"Enter my own electric rates",null,2,"Enter my own oil rates",2,"Enter my own propane rates"]
[]
[null,"State",null,"City","Total Heating Load MMBtu","ASHRAE Design Temp",null,null,"eGRID Subregion"]
[1,"AK",{"$f":"IF(B119=activestate,IF(B119=activestate,C118+1,1),0)","v":0},"Anchorage",89.101272000000009,-10,1,{"$f":"IF(ISERROR(VLOOKUP(1,$C119:$D$346,2,0)),\"\",VLOOKUP(1,$C119:$D$346,2,0))","v":""},"AKGD","ASCC Alaska Grid"]
[2,"AK",{"$f":"IF(B120=activestate,IF(B120=activestate,C119+1,1),0)","v":0},"Annette",52.489176,17,2,{"$f":"IF(ISERROR(VLOOKUP(2,$C120:$D$346,2,0)),\"\",VLOOKUP(2,$C120:$D$346,2,0))","v":""},"AKMS","ASCC Miscellaneous"]
[3,"AK",0,"Bethel",130.026096,-24,3,{"$f":"IF(ISERROR(VLOOKUP(3,$C121:$D$346,2,0)),\"\",VLOOKUP(3,$C121:$D$346,2,0))","v":""},"AKMS","ASCC Miscellaneous"]
[4,"AK",0,"Big Delta",130.79267999999999,-39,4,{"$f":"IF(ISERROR(VLOOKUP(4,$C122:$D$346,2,0)),\"\",VLOOKUP(4,$C122:$D$346,2,0))","v":""},"AKMS","ASCC Miscellaneous"]
[5,"AK",0,"Cold Bay",90.597239999999999,10,5,{"$f":"IF(ISERROR(VLOOKUP(5,$C123:$D$346,2,0)),\"\",VLOOKUP(5,$C123:$D$346,2,0))","v":""},"AKMS","ASCC Miscellaneous"]
[6,"AK",0,"Fairbanks",138.521424,-36,6,{"$f":"IF(ISERROR(VLOOKUP(6,$C124:$D$346,2,0)),\"\",VLOOKUP(6,$C124:$D$346,2,0))","v":""},"AKGD","ASCC Alaska Grid"]
[7,"AK",0,"Gulkana",125.008488,-39,7,{"$f":"IF(ISERROR(VLOOKUP(7,$C125:$D$346,2,0)),\"\",VLOOKUP(7,$C125:$D$346,2,0))","v":""},"AKGD","ASCC Alaska Grid"]
[8,"AK",0,"King Salmon",103.70272799999998,-19,8,{"$f":"IF(ISERROR(VLOOKUP(8,$C126:$D$346,2,0)),\"\",VLOOKUP(8,$C126:$D$346,2,0))","v":""},"AKMS","ASCC Miscellaneous"]
[9,"AK",0,"Kodiak",71.07996,12,9,{"$f":"IF(ISERROR(VLOOKUP(9,$C127:$D$346,2,0)),\"\",VLOOKUP(9,$C127:$D$346,2,0))","v":""},"AKMS","ASCC Miscellaneous"]
[10,"AK",0,"McGrath",135.15578400000001,-42,10,{"$f":"IF(ISERROR(VLOOKUP(10,$C128:$D$346,2,0)),\"\",VLOOKUP(10,$C128:$D$346,2,0))","v":""},"AKMS","ASCC Miscellaneous"]
[11,"AK",0,"Nome",133.41172799999998,-26,11,{"$f":"IF(ISERROR(VLOOKUP(11,$C129:$D$346,2,0)),\"\",VLOOKUP(11,$C129:$D$346,2,0))","v":""},"AKMS","ASCC Miscellaneous"]
[12,"AK",0,"St Paul Island",110.81215200000001,3,12,{"$f":"IF(ISERROR(VLOOKUP(12,$C130:$D$346,2,0)),\"\",VLOOKUP(12,$C130:$D$346,2,0))","v":""},"AKMS","ASCC Miscellaneous"]
[13,"AK",0,"Talkeetna",99.339048000000005,-21,13,{"$f":"IF(ISERROR(VLOOKUP(13,$C131:$D$346,2,0)),\"\",VLOOKUP(13,$C131:$D$346,2,0))","v":""},"AKGD","ASCC Alaska Grid"]
[14,"AK",0,"Yakutat",76.199879999999993,2,14,{"$f":"IF(ISERROR(VLOOKUP(14,$C132:$D$346,2,0)),\"\",VLOOKUP(14,$C132:$D$346,2,0))","v":""},"AKMS","ASCC Miscellaneous"]
[15,"AL",0,"Birmingham",30.851112000000001,23,15,{"$f":"IF(ISERROR(VLOOKUP(15,$C133:$D$346,2,0)),\"\",VLOOKUP(15,$C133:$D$346,2,0))","v":""},"SRSO","SERC South"]
[16,"AL",0,"Huntsville",38.930304,20,null,null,"SRTV","SERC Tennessee Valley"]
[17,"AL",0,"Mobile",23.041128,30,null,null,"SRSO","SERC South"]
[18,"AL",0,"Montgomery",24.812711999999998,27,null,null,"SRSO","SERC South"]
[19,"AR",0,"Fort Smith",35.974752000000002,19,null,null,"SRMV","SERC Mississippi Valley"]
[20,"AR",0,"Little Rock",34.761552000000002,21,null,null,"SRMV","SERC Mississippi Valley"]
[21,"AZ",0,"Flagstaff",45.181752000000003,8,null,null,"AZNM","WECC Southwest"]
[22,"AZ",0,"Phoenix",16.992671999999999,37.5,null,null,"AZNM","WECC Southwest"]
[23,"AZ",0,"Prescott",34.038288000000009,20,null,null,"AZNM","WECC Southwest"]
[24,"AZ",0,"Tucson",19.630752000000001,34,null,null,"AZNM","WECC Southwest"]
[25,"CA",0,"Arcata",23.696064,32,null,null,"CAMX","WECC California"]
[26,"CA",0,"Bakersfield",22.651848000000001,35,null,null,"CAMX","WECC California"]
[27,"CA",0,"Daggett",20.389320000000001,32,null,null,"CAMX","WECC California"]
[28,"CA",0,"Fresno",29.731992000000005,32,null,null,"CAMX","WECC California"]
[29,"CA",0,"Long Beach",15.272472000000002,43,null,null,"CAMX","WECC California"]
[30,"CA",0,"Los Angeles",13.936680000000001,45,null,null,"CAMX","WECC California"]
[31,"CA",0,"Sacramento",31.808664,33,null,null,"CAMX","WECC California"]
[32,"CA",0,"San Diego",10.032456,44,null,null,"CAMX","WECC California"]
[33,"CA",0,"San Francisco",20.737296000000001,39,null,null,"CAMX","WECC California"]
[34,"CA",0,"Santa Maria",20.624375999999998,35,null,null,"CAMX","WECC California"]
[35,"CO",0,"Alamosa",57.752184,-11,null,null,"RMPA","WECC Rockies"]
[36,"CO",0,"Co. Springs",46.840200000000003,4,null,null,"RMPA","WECC Rockies"]
[37,"CO",0,"Eagle",60.644495999999997,-7,null,null,"RMPA","WECC Rockies"]
[38,"CO",0,"Pueblo",40.669824000000006,5,null,null,"RMPA","WECC Rockies"]
[39,"CT",0,"Bridgeport",51.654816000000004,12,null,null,"NEWE","NPCC New England"]
[40,"CT",0,"Hartford",53.078496000000001,6,null,null,"NEWE","NPCC New England"]
[41,"DC",0,"Washington",45.549647999999998,20,null,null,"RFCE","RFC East"]
[42,"DE",0,"Wilmington",49.679831999999998,14,null,null,"RFCE","RFC East"]
[43,"FL",0,"Daytona Beach",13.380072000000002,37,null,null,"FRCC","FRCC All"]
[44,"FL",0,"Jacksonville ",17.972663999999998,35,null,null,"FRCC","FRCC All"]
[45,"FL",0,"Key West",0.26263199999999998,58,null,null,"FRCC","FRCC All"]
[46,"FL",0,"Miami",0.93772800000000012,49.5,null,null,"FRCC","FRCC All"]
[47,"FL",0,"Tallahassee",21.522959999999998,28,null,null,"FRCC","FRCC All"]
[48,"FL",0,"Tampa",11.346575999999999,40,null,null,"FRCC","FRCC All"]
[49,"FL",0,"W. Palm Beach",1.1881439999999999,47,null,null,"FRCC","FRCC All"]
[50,"GA",0,"Athens",29.374319999999997,25,null,null,"SRSO","SERC South"]
[51,"GA",0,"Atlanta",33.156744000000003,23,null,null,"SRSO","SERC South"]
[52,"GA",0,"Augusta",30.426432000000005,25,null,null,"SRSO","SERC South"]
[53,"GA",0,"Columbus",27.519264,27,null,null,"SRSO","SERC South"]
[54,"GA",0,"Macon",28.642199999999995,27,null,null,"SRSO","SERC South"]
[55,"GA",0,"Savannah",24.540600000000001,29,null,null,"SRSO","SERC South"]
[56,"HI",0,"Hilo",8.2319999999999997E-3,63,null,null,"HIMS","HICC Miscellaneous"]
[57,"HI",0,"Honolulu",1.5072E-2,63,null,null,"HIOA","HICC Oahu"]
[58,"HI",0,"Kahului",5.8512000000000002E-2,61,null,null,"HIMS","HICC Miscellaneous"]
[59,"HI",0,"Lihue",2.3400000000000004E-2,62,null,null,"HIMS","HICC Miscellaneous"]
[60,"IA",0,"Des Moines",59.738063999999994,-4,null,null,"MROW","MRO West"]
[61,"IA",0,"Mason City",77.026559999999989,-10,null,null,"MROW","MRO West"]
[62,"IA",0,"Sioux City",62.784408000000013,-6,null,null,"MROW","MRO West"]
[63,"IA",0,"Waterloo",66.531672000000015,-9,null,null,"MROW","MRO West"]
[64,"ID",0,"Boise",46.086191999999997,9,null,null,"NWPP","WECC Northwest"]
[65,"ID",{"$f":"IF(B183=activestate,IF(B183=activestate,C182+1,1),0)","v":0},"Pocatello",57.145296000000002,0,null,null,"NWPP","WECC Northwest"]
[66,"IL",0,"Chicago",59.997504000000006,1,null,null,"RFCW","RFC West"]
[67,"IL",0,"Moline",58.896287999999998,-3,null,null,"MROW","MRO West"]
[68,"IL",0,"Peoria",57.961920000000006,-1,null,null,"SRMW","SERC Midwest"]
[69,"IL",0,"Rockford",62.672903999999996,-4,null,null,"RFCW","RFC West"]
[70,"IL",0,"Springfield",55.854239999999997,2,null,null,"SRMW","SERC Midwest"]
[71,"IN",0,"Evansville",46.528464,9,null,null,"RFCW","RFC West"]
[72,"IN",0,"Fort Wayne",57.395927999999998,2,null,null,"RFCW","RFC West"]
[73,"IN",0,"Indianapolis ",50.910743999999994,3,null,null,"RFCW","RFC West"]
[74,"KS",0,"Dodge City",50.542872000000003,6,null,null,"SPNO","SPP North"]
[75,"KS",0,"Goodland",55.819535999999999,2,null,null,"SPNO","SPP North"]
[76,"KS",0,"Topeka",52.701768000000001,4,null,null,"SPNO","SPP North"]
[77,"KS",0,"Wichita",48.720312000000007,9,null,null,"SPNO","SPP North"]
[78,"KY",0,"Covington",53.051639999999999,7,null,null,"SRTV","SERC Tennessee Valley"]
[79,"KY",0,"Lexington",49.946567999999999,10,null,null,"SRTV","SERC Tennessee Valley"]
[80,"KY",0,"Louisville",43.182935999999998,12,null,null,"SRTV","SERC Tennessee Valley"]
[81,"LA",0,"Baton Rouge",20.404727999999999,30,null,null,"SRMV","SERC Mississippi Valley"]
[82,"LA",0,"Lake Charles ",22.615511999999995,32,null,null,"SRMV","SERC Mississippi Valley"]
[83,"LA",0,"New Orleans",18.251856,36.5,null,null,"SRMV","SERC Mississippi Valley"]
[84,"LA",0,"Shreveport",26.419920000000005,26,null,null,"SPSO","SPP South"]
[85,"MA",0,"Boston",52.874903999999994,12,null,null,"NEWE","NPCC New England"]
[86,"MA",0,"Worcester",58.759152000000007,5,null,null,"NEWE","NPCC New England"]
[87,"MD",0,"Baltimore",45.549647999999998,15,null,null,"RFCE","RFC East"]
[88,"ME",0,"Caribou",82.709711999999996,-10,null,null,"NEWE","NPCC New England"]
[89,"ME",0,"Portland",61.914263999999996,2,null,null,"NEWE","NPCC New England"]
[90,"MI",0,"Alpena",72.614976000000013,-1,null,null,"RFCM","RFC Michigan"]
[91,"MI",0,"Detroit",59.892983999999998,5,null,null,"RFCM","RFC Michigan"]
[92,"MI",0,"Flint",63.521711999999987,3,null,null,"RFCM","RFC Michigan"]
[93,"MI",0,"Grand Rapids ",64.766831999999994,5,null,null,"RFCM","RFC Michigan"]
[94,"MI",0,"Lansing",64.708631999999994,2,null,null,"RFCM","RFC Michigan"]
[95,"MI",0,"Muskegon",65.559287999999995,7,null,null,"RFCM","RFC Michigan"]
[96,"MI",0,"Sault St Marie",77.073288000000019,-7,null,null,"RFCW","RFC West"]
[97,"MI",0,"Traverse City",69.983136000000002,2,null,null,"RFCM","RFC Michigan"]
[98,"MN",0,"Duluth",89.604407999999992,-16,null,null,"MROW","MRO West"]
[99,"MN",0,"Int. Falls",92.407079999999993,-23,null,null,"MROW","MRO West"]
[100,"MN",0,"Minneapolis",72.719279999999998,-11,null,null,"MROW","MRO West"]
[101,"MN",0,"Rochester",77.707344000000006,-12,null,null,"MROW","MRO West"]
[102,"MN",0,"Saint Cloud",79.478759999999994,-14,null,null,"MROW","MRO West"]
[103,"MO",0,"Columbia",52.221552000000003,5,null,null,"SRMW","SERC Midwest"]
[104,"MO",0,"Kansas City",51.011231999999993,4,null,null,"SPNO","SPP North"]
[105,"MO",0,"Springfield",45.755136,9,null,null,"SRMW","SERC Midwest"]
[106,"MO",0,"St. Louis",51.243287999999993,8,null,null,"SRMW","SERC Midwest"]
[107,"MS",0,"Jackson",28.009152000000007,25,null,null,"SRMV","SERC Mississippi Valley"]
[108,"MS",0,"Meridian",26.646048,25,null,null,"SRTV","SERC Tennessee Valley"]
[109,"MT",0,"Billings",60.364007999999998,-7,null,null,"NWPP","WECC Northwest"]
[110,"MT",0,"Cut Bank",68.615279999999998,-16,null,null,"NWPP","WECC Northwest"]
[111,"MT",0,"Glasgow",82.574880000000007,-17,null,null,"NWPP","WECC Northwest"]
[112,"MT",0,"Great Falls",67.408079999999998,-12,null,null,"NWPP","WECC Northwest"]
[113,"MT",0,"Helena",62.569776000000005,-10,null,null,"NWPP","WECC Northwest"]
[114,"MT",0,"Kalispell",65.484167999999997,-3,null,null,"NWPP","WECC Northwest"]
[115,"MT",0,"Lewistown",68.752416000000011,-12,null,null,"NWPP","WECC Northwest"]
[116,"MT",0,"Miles City",68.669544000000002,-13,null,null,"MROW","MRO West"]
[117,"MT",0,"Missoula",65.729064000000008,-1,null,null,"NWPP","WECC Northwest"]
[118,"NC",0,"Asheville",40.406664000000006,16,null,null,"SRVC","SERC Virginia/Carolina"]
[119,"NC",0,"Cape Hatteras",29.096952000000002,29,null,null,"SRVC","SERC Virginia/Carolina"]
[120,"NC",0,"Charlotte",34.469327999999997,23,null,null,"SRVC","SERC Virginia/Carolina"]
[121,"NC",0,"Greensboro",36.449856000000004,19,null,null,"SRVC","SERC Virginia/Carolina"]
[122,"NC",0,"Raleigh",31.301688000000002,20,null,null,"SRVC","SERC Virginia/Carolina"]
[123,"NC",0,"Wilmington",29.195111999999998,27,null,null,"RFCE","RFC East"]
[124,"ND",0,"Bismarck",79.30192799999999,-16,null,null,"MROW","MRO West"]
[125,"ND",0,"Fargo",86.611919999999998,-17,null,null,"MROW","MRO West"]
[126,"ND",0,"Minot",87.025800000000004,-16,null,null,"MROW","MRO West"]
[127,"NE",0,"Grand Island",56.035536000000008,-2,null,null,"MROW","MRO West"]
[128,"NE",0,"Norfolk",65.198304000000007,-5,null,null,"MROW","MRO West"]
[129,"NE",{"$f":"IF(B247=activestate,IF(B247=activestate,C246+1,1),0)","v":0},"North Platte",56.944872000000004,-4,null,null,"MROW","MRO West"]
[130,"NE",0,"Omaha",52.580975999999993,-2,null,null,"MROW","MRO West"]
[131,"NE",0,"Scottsbluff",52.205976000000007,-3,null,null,"RMPA","WECC Rockies"]
[132,"NH",0,"Concord",64.254647999999989,-2,null,null,"NEWE","NPCC New England"]
[133,"NJ",0,"Atlantic City",48.910775999999998,13,null,null,"RFCE","RFC East"]
[134,"NJ",0,"Newark",50.784192000000004,14,null,null,"RFCE","RFC East"]
[135,"NM",0,"Albuquerque",34.750392000000005,18,null,null,"AZNM","WECC Southwest"]
[136,"NM",0,"Tucumcari",33.270479999999999,15,null,null,"SPSO","SPP South"]
[137,"NV",0,"Elko",51.826391999999998,1,null,null,"NWPP","WECC Northwest"]
[138,"NV",0,"Ely",57.210144,0,null,null,"NWPP","WECC Northwest"]
[139,"NV",0,"Las Vegas",23.665008,30,null,null,"AZNM","WECC Southwest"]
[140,"NV",0,"Reno",39.436775999999995,13,null,null,"NWPP","WECC Northwest"]
[141,"NV",0,"Tonopah",39.820272000000003,13,null,null,"NWPP","WECC Northwest"]
[142,"NV",0,"Winnemucca",46.267176000000006,7,null,null,"NWPP","WECC Northwest"]
[143,"NY",0,"Albany",62.246447999999994,-2,null,null,"NYUP","NPCC Upstate NY"]
[144,"NY",0,"Binghamton",64.550087999999988,2,null,null,"NYUP","NPCC Upstate NY"]
[145,"NY",0,"Buffalo",62.513232000000002,5,null,null,"NYUP","NPCC Upstate NY"]
[146,"NY",0,"Massena",76.433855999999992,-10,null,null,"NYUP","NPCC Upstate NY"]
[147,"NY",0,"New York City",50.005871999999997,16,null,null,"NYCW","NPCC NYC/Westchester"]
[148,"NY",0,"Rochester",61.047480000000007,5,null,null,"MROW","MRO West"]
[149,"NY",0,"Syracuse",62.843136000000001,2,null,null,"NYUP","NPCC Upstate NY"]
[150,"OH",0,"Akron",54.355440000000002,5,null,null,"RFCW","RFC West"]
[151,"OH",0,"Cleveland",56.729904000000005,6,null,null,"RFCW","RFC West"]
[152,"OH",0,"Columbus",51.573983999999989,8,null,null,"SRSO","SERC South"]
[153,"OH",0,"Dayton",54.34523999999999,6.5,null,null,"RFCW","RFC West"]
[154,"OH",0,"Mansfield",59.117111999999999,4,null,null,"RFCW","RFC West"]
[155,"OH",0,"Toledo",60.366095999999999,3,null,null,"RFCW","RFC West"]
[156,"OH",0,"Youngstown",61.321056000000013,4,null,null,"RFCW","RFC West"]
[157,"OK",0,"Oklahoma City",42.896736000000004,16,null,null,"SPSO","SPP South"]
[158,"OK",0,"Tulsa",42.857064000000001,14,null,null,"SPSO","SPP South"]
[159,"OR",0,"Astoria",31.410263999999998,29,null,null,"NWPP","WECC Northwest"]
[160,"OR",0,"Eugene",34.74024,26,null,null,"NWPP","WECC Northwest"]
[161,"OR",0,"Medford",39.751632000000001,24,null,null,"NWPP","WECC Northwest"]
[162,"OR",0,"North Bend",23.013168,32,null,null,"NWPP","WECC Northwest"]
[163,"OR",0,"Pendleton",44.462687999999993,11,null,null,"NWPP","WECC Northwest"]
[164,"OR",0,"Portland",36.322704000000002,27,null,null,"NEWE","NPCC New England"]
[165,"OR",0,"Redmond",48.436368000000009,9,null,null,"NWPP","WECC Northwest"]
[166,"OR",0,"Salem",36.586944000000003,25,null,null,"NWPP","WECC Northwest"]
[167,"PA",0,"Allentown",55.455455999999998,10,null,null,"RFCE","RFC East"]
[168,"PA",0,"Bradford",69.942815999999993,-1,null,null,"RFCE","RFC East"]
[169,"PA",0,"Erie",65.967216000000008,7,null,null,"RFCE","RFC East"]
[170,"PA",0,"Harrisburg",46.221383999999993,13,null,null,"RFCE","RFC East"]
[171,"PA",0,"Philadelphia ",49.990296000000001,14.33,null,null,"RFCE","RFC East"]
[172,"PA",0,"Pittsburgh",53.840615999999997,9,null,null,"RFCW","RFC West"]
[173,"PA",0,"Wilkes-Barre ",57.530184000000006,7,null,null,"RFCE","RFC East"]
[174,"PA",0,"Williamsport ",52.247664,7,null,null,"RFCE","RFC East"]
[175,"RI",0,"Providence",52.454328000000004,10,null,null,"NEWE","NPCC New England"]
[176,"SC",0,"Charleston",25.988616,28,null,null,"SRVC","SERC Virginia/Carolina"]
[177,"SC",0,"Columbia",28.496976,24,null,null,"SRMW","SERC Midwest"]
[178,"SC",0,"Greenville",34.385280000000002,23,null,null,"SRVC","SERC Virginia/Carolina"]
[179,"SD",0,"Huron",76.019760000000005,-12,null,null,"MROW","MRO West"]
[180,"SD",0,"Pierre",65.182079999999999,-9,null,null,"MROW","MRO West"]
[181,"SD",0,"Rapid City",60.722712000000016,-5,null,null,"MROW","MRO West"]
[182,"SD",0,"Sioux Falls",71.137703999999999,-11,null,null,"MROW","MRO West"]
[183,"TN",0,"Bristol",37.724736,14,null,null,"SRTV","SERC Tennessee Valley"]
[184,"TN",0,"Chattanooga",31.879703999999997,20,null,null,"SRTV","SERC Tennessee Valley"]
[185,"TN",0,"Knoxville",33.765312000000002,19,null,null,"SRTV","SERC Tennessee Valley"]
[186,"TN",0,"Memphis",34.006943999999997,21,null,null,"SRTV","SERC Tennessee Valley"]
[187,"TN",0,"Nashville",37.762391999999998,16,null,null,"SRTV","SERC Tennessee Valley"]
[188,"TX",0,"Abilene",32.092656000000005,22,null,null,"ERCT","ERCOT All"]
[189,"TX",0,"Amarillo",44.216856,12,null,null,"SPSO","SPP South"]
[190,"TX",0,"Austin",21.523727999999998,30,null,null,"ERCT","ERCOT All"]
[191,"TX",0,"Brownsville",13.144080000000001,40,null,null,"ERCT","ERCOT All"]
[192,"TX",0,"Corpus Christi",15.357168,36,null,null,"ERCT","ERCOT All"]
[193,"TX",{"$f":"IF(B311=activestate,IF(B311=activestate,C310+1,1),0)","v":0},"El Paso",24.154536,25,null,null,"AZNM","WECC Southwest"]
[194,"TX",0,"Fort Worth",27.312575999999996,24,null,null,"ERCT","ERCOT All"]
[195,"TX",0,"Houston",19.807152000000002,32.5,null,null,"ERCT","ERCOT All"]
[196,"TX",0,"Lubbock",37.668168000000001,17.5,null,null,"ERCT","ERCOT All"]
[197,"TX",0,"Lufkin",24.164928000000003,27,null,null,"SRMV","SERC Mississippi Valley"]
[198,"TX",0,"Midland",30.533472000000003,22,null,null,"ERCT","ERCOT All"]
[199,"TX",0,"San Angelo",32.623511999999998,24,null,null,"ERCT","ERCOT All"]
[200,"TX",0,"Victoria",16.445376,33,null,null,"ERCT","ERCOT All"]
[201,"TX",0,"Waco",27.388343999999996,26,null,null,"ERCT","ERCOT All"]
[202,"TX",0,"Wichita Falls",38.54712,19,null,null,"ERCT","ERCOT All"]
[203,"UT",0,"Cedar City",43.593119999999999,8,null,null,"NWPP","WECC Northwest"]
[204,"UT",0,"Salt Lake City",44.005344000000008,11,null,null,"NWPP","WECC Northwest"]
[205,"VA",0,"Lynchburg",39.168864000000006,17,null,null,"RFCW","RFC West"]
[206,"VA",0,"Norfolk",32.913143999999996,24,null,null,"SRVC","SERC Virginia/Carolina"]
[207,"VA",0,"Richmond",34.488624000000002,18,null,null,"SRVC","SERC Virginia/Carolina"]
[208,"VA",0,"Roanoke",39.257040000000003,17,null,null,"RFCW","RFC West"]
[209,"VA",0,"Sterling",50.067575999999988,14,null,null,"SRVC","SERC Virginia/Carolina"]
[210,"VT",0,"Burlington",70.032960000000003,-6,null,null,"NEWE","NPCC New England"]
[211,"WA",0,"Olympia",42.373583999999994,23,null,null,"NWPP","WECC Northwest"]
[212,"WA",0,"Quillayute",36.172008000000005,27,null,null,"NWPP","WECC Northwest"]
[213,"WA",0,"Seattle",37.623503999999997,28,null,null,"NWPP","WECC Northwest"]
[214,"WA",0,"Spokane",55.130375999999991,7,null,null,"NWPP","WECC Northwest"]
[215,"WA",0,"Yakima",48.388151999999998,11,null,null,"NWPP","WECC Northwest"]
[216,"WI",0,"Eau Claire",77.629103999999998,-13,null,null,"MROW","MRO West"]
[217,"WI",0,"Green Bay",76.195463999999987,-8,null,null,"MROE","MRO East"]
[218,"WI",0,"La Crosse",68.448792000000012,-8,null,null,"MROW","MRO West"]
[219,"WI",0,"Madison",65.382815999999991,-6,null,null,"MROE","MRO East"]
[220,"WI",0,"Milwaukee",68.645784000000006,-2,null,null,"RFCW","RFC West"]
[221,"WV",0,"Charleston",42.644831999999994,11,null,null,"SRVC","SERC Virginia/Carolina"]
[222,"WV",0,"Elkins",52.430064000000002,5,null,null,"RFCW","RFC West"]
[223,"WV",0,"Huntington",43.979256000000007,11,null,null,"RFCW","RFC West"]
[224,"WY",0,"Casper",63.309023999999994,-5,null,null,"RMPA","WECC Rockies"]
[225,"WY",0,"Cheyenne",55.74148799999999,0,null,null,"RMPA","WECC Rockies"]
[226,"WY",0,"Lander",53.530968000000001,-7,null,null,"RMPA","WECC Rockies"]
[227,"WY",0,"Rock Springs ",64.767335999999986,-2,null,null,"RMPA","WECC Rockies"]
[228,"WY",0,"Sheridan",58.832975999999988,-8,null,null,"NWPP","WECC Northwest"]
[]
[]
[]
[null,"Home Size (sqft)"]
[1,2000]
[2,3000]
[3,4000]
[]
[]
[]
[1,"I will enter my own rate"]
[2,"Use default average state/province rate"]

{"sheet":"Heating Load","index":2,"n_rows":243,"n_cols":11,"rows_kept":243,"cut":false,"hidden":false,"merged":[]}
[null,null,null,"Heat Load","2,000 sqft","3,000 sqft","4,000 sqft","slope","intercept",null,"Selected sqft"]
[null,{"$f":"activestate","v":"US"},{"$f":"LOOKUP(city,Lists!G119:G133,Lists!H119:H133)","v":""},null,{"$f":"VLOOKUP(1,B4:E243,4,0)","v":49.469595263157885},{"$f":"VLOOKUP(1,B4:F243,5,0)","v":65.263807999999955},{"$f":"VLOOKUP(1,B4:G243,6,0)","v":80.04382378947372},{"$f":"SLOPE(E2:G2,homesize)","v":1.5287114263157917E-2},{"$f":"INTERCEPT(E2:G2,homesize)","v":19.064399561403434},null,{"$f":"(sqft*H2)+I2","v":49.638628087719269}]
[null,"Active","State","City","Total Heating Load MMBtu (2000 sqft)","Total Heating Load MMBtu (3000 sqft)","Total Heating Load MMBtu (4000 sqft)"]
[1,{"$f":"IF(C4=activestate,IF(D4=C$2,1,0),0)","v":0},"AK","Anchorage",89.101272000000009,117.44049599999998,144.55022399999999]
[2,0,"AK","Annette",52.489176,68.840400000000002,84.332808]
[3,0,"AK","Bethel",130.026096,173.18315999999999,213.789072]
[4,0,"AK","Big Delta",130.79267999999999,173.33462399999999,212.44766400000003]
[5,0,"AK","Cold Bay",90.597239999999999,119.39068800000001,145.48883999999998]
[6,0,"AK","Fairbanks",138.521424,182.28103200000001,225.53659200000004]
[7,0,"AK","Gulkana",125.008488,164.884896,203.18772000000001]
[8,0,"AK","King Salmon",103.70272799999998,136.59804,168.18247200000002]
[9,0,"AK","Kodiak",71.07996,93.198120000000003,114.294336]
[10,0,"AK","McGrath",135.15578400000001,177.43106399999999,219.12885600000001]
[11,0,"AK","Nome",133.41172799999998,176.02452000000002,214.98792]
[12,0,"AK","St Paul Island",110.81215200000001,146.2098,178.37767199999996]
[13,0,"AK","Talkeetna",99.339048000000005,130.98854399999999,159.90475200000003]
[14,0,"AK","Yakutat",76.199879999999993,99.960335999999998,121.440912]
[15,0,"AL","Birmingham",30.851112000000001,41.528184000000003,51.583368]
[16,0,"AL","Huntsville",38.930304,52.201823999999995,64.708247999999998]
[17,0,"AL","Mobile",23.041128,31.659312000000003,39.652391999999999]
[18,0,"AL","Montgomery",24.812711999999998,33.599903999999995,41.900832000000001]
[19,0,"AR","Fort Smith",35.974752000000002,48.692256,60.457967999999994]
[20,0,"AR","Little Rock",34.761552000000002,47.041223999999993,58.397016000000001]
[21,0,"AZ","Flagstaff",45.181752000000003,58.582416000000002,71.048328000000012]
[22,0,"AZ","Phoenix",16.992671999999999,23.402880000000003,29.626271999999993]
[23,0,"AZ","Prescott",34.038288000000009,44.472575999999997,54.183480000000003]
[24,0,"AZ","Tucson",19.630752000000001,27.052224000000002,34.11636]
[25,0,"CA","Arcata",23.696064,30.755231999999999,37.187472000000007]
[26,0,"CA","Bakersfield",22.651848000000001,30.477024,37.990704000000001]
[27,0,"CA","Daggett",20.389320000000001,27.812975999999999,35.171880000000002]
[28,0,"CA","Fresno",29.731992000000005,40.181975999999992,50.041176000000007]
[29,0,"CA","Long Beach",15.272472000000002,20.924280000000003,26.200944000000007]
[30,0,"CA","Los Angeles",13.936680000000001,19.008288,23.703576000000002]
[31,0,"CA","Sacramento",31.808664,43.276032000000008,53.853695999999999]
[32,0,"CA","San Diego",10.032456,13.751519999999999,17.041464000000001]
[33,0,"CA","San Francisco",20.737296000000001,28.070304,35.009040000000006]
[34,0,"CA","Santa Maria",20.624375999999998,28.069391999999997,35.035295999999995]
[35,0,"CO","Alamosa",57.752184,75.125472000000002,90.952008000000006]
[36,0,"CO","Co. Springs",46.840200000000003,61.195848000000012,74.212704000000002]
[37,0,"CO","Eagle",60.644495999999997,78.518783999999997,95.173823999999996]
[38,0,"CO","Pueblo",40.669824000000006,53.504400000000004,65.200608000000003]
[39,0,"CT","Bridgeport",51.654816000000004,67.910927999999998,82.619351999999992]
[40,0,"CT","Hartford",53.078496000000001,69.798552000000001,84.937727999999993]
[41,0,"DC","Washington",45.549647999999998,59.905200000000001,72.905063999999996]
[42,0,"DE","Wilmington",49.679831999999998,65.261207999999996,79.368335999999999]
[43,0,"FL","Daytona Beach",13.380072000000002,18.462335999999997,23.266512000000002]
[44,0,"FL","Jacksonville ",17.972663999999998,24.586296000000001,31.098984000000002]
[45,0,"FL","Key West",0.26263199999999998,0.41445599999999994,0.56344800000000006]
[46,0,"FL","Miami",0.93772800000000012,1.4244240000000001,1.9024799999999999]
[47,0,"FL","Tallahassee",21.522959999999998,29.286888000000005,36.802056]
[48,0,"FL","Tampa",11.346575999999999,15.858096,20.054712000000002]
[49,0,"FL","W. Palm Beach",1.1881439999999999,1.7241360000000003,2.242896]
[50,0,"GA","Athens",29.374319999999997,39.497399999999999,49.029647999999995]
[51,0,"GA","Atlanta",33.156744000000003,44.839031999999989,55.615415999999996]
[52,0,"GA","Augusta",30.426432000000005,41.028599999999997,51.048264000000003]
[53,0,"GA","Columbus",27.519264,37.378728000000002,46.495320000000007]
[54,0,"GA","Macon",28.642199999999995,38.698728000000003,48.193463999999992]
[55,0,"GA","Savannah",24.540600000000001,33.677928000000001,42.162959999999998]
[56,0,"HI","Hilo",8.2319999999999997E-3,2.2055999999999999E-2,3.8039999999999997E-2]
[57,0,"HI","Honolulu",1.5072E-2,2.6687999999999996E-2,3.9455999999999998E-2]
[58,0,"HI","Kahului",5.8512000000000002E-2,0.103104,0.15069600000000002]
[59,0,"HI","Lihue",2.3400000000000004E-2,4.8071999999999997E-2,7.5791999999999998E-2]
[60,0,"IA","Des Moines",59.738063999999994,78.667511999999988,96.881544000000005]
[61,0,"IA","Mason City",77.026559999999989,101.54599200000001,123.88533600000001]
[62,0,"IA","Sioux City",62.784408000000013,82.765703999999999,100.96120800000001]
[63,0,"IA","Waterloo",66.531672000000015,87.806184000000002,107.20320000000001]
[64,0,"ID","Boise",46.086191999999997,60.494711999999993,73.516631999999987]
[65,{"$f":"IF(C68=activestate,IF(D68=C$2,1,0),0)","v":0},"ID","Pocatello",57.145296000000002,74.90272800000001,91.85469599999999]
[66,0,"IL","Chicago",59.997504000000006,79.013615999999999,97.280688000000012]
[67,0,"IL","Moline",58.896287999999998,77.77727999999999,94.974192000000002]
[68,0,"IL","Peoria",57.961920000000006,76.445279999999997,93.273239999999987]
[69,0,"IL","Rockford",62.672903999999996,81.792264000000003,100.65727199999999]
[70,0,"IL","Springfield",55.854239999999997,73.706760000000003,90.908616000000009]
[71,0,"IN","Evansville",46.528464,61.507799999999996,75.110472000000001]
[72,0,"IN","Fort Wayne",57.395927999999998,75.658224000000004,93.191231999999999]
[73,0,"IN","Indianapolis ",50.910743999999994,67.164959999999994,81.916128]
[74,0,"KS","Dodge City",50.542872000000003,66.469632000000004,81.782111999999998]
[75,0,"KS","Goodland",55.819535999999999,73.282104000000004,90.103464000000002]
[76,0,"KS","Topeka",52.701768000000001,69.551568000000003,84.901752000000016]
[77,0,"KS","Wichita",48.720312000000007,64.212167999999991,79.095960000000005]
[78,0,"KY","Covington",53.051639999999999,69.967607999999984,85.322447999999994]
[79,0,"KY","Lexington",49.946567999999999,65.290487999999982,79.544424000000006]
[80,0,"KY","Louisville",43.182935999999998,56.519063999999993,68.923199999999994]
[81,0,"LA","Baton Rouge",20.404727999999999,27.875736000000003,34.936968000000007]
[82,0,"LA","Lake Charles ",22.615511999999995,30.832799999999995,38.603639999999992]
[83,0,"LA","New Orleans",18.251856,24.923904000000004,31.219679999999997]
[84,0,"LA","Shreveport",26.419920000000005,35.666927999999999,44.773343999999994]
[85,0,"MA","Boston",52.874903999999994,69.31183200000001,85.090487999999993]
[86,0,"MA","Worcester",58.759152000000007,76.856904000000014,94.162295999999998]
[87,0,"MD","Baltimore",45.549647999999998,59.905200000000001,72.905063999999996]
[88,0,"ME","Caribou",82.709711999999996,108.77025600000002,132.43428000000003]
[89,0,"ME","Portland",61.914263999999996,81.157488000000015,98.565888000000001]
[90,0,"MI","Alpena",72.614976000000013,95.548007999999996,116.37595199999998]
[91,0,"MI","Detroit",59.892983999999998,78.903624000000008,97.123079999999987]
[92,0,"MI","Flint",63.521711999999987,83.056991999999994,102.29592]
[93,0,"MI","Grand Rapids ",64.766831999999994,84.672935999999993,104.27282400000001]
[94,0,"MI","Lansing",64.708631999999994,84.684767999999991,104.37722400000003]
[95,0,"MI","Muskegon",65.559287999999995,85.834511999999989,105.83011200000001]
[96,0,"MI","Sault St Marie",77.073288000000019,101.44418400000001,124.79865599999999]
[97,0,"MI","Traverse City",69.983136000000002,92.303832,113.721408]
[98,0,"MN","Duluth",89.604407999999992,117.895296,143.62528799999998]
[99,0,"MN","Int. Falls",92.407079999999993,121.72908000000002,148.44343200000003]
[100,0,"MN","Minneapolis",72.719279999999998,95.778935999999987,116.76007200000001]
[101,0,"MN","Rochester",77.707344000000006,103.255608,125.90976000000001]
[102,0,"MN","Saint Cloud",79.478759999999994,104.509536,127.27315199999998]
[103,0,"MO","Columbia",52.221552000000003,68.251655999999997,84.018215999999995]
[104,0,"MO","Kansas City",51.011231999999993,67.174871999999993,81.854664000000014]
[105,0,"MO","Springfield",45.755136,60.359712000000002,74.342016000000001]
[106,0,"MO","St. Louis",51.243287999999993,67.718688000000014,82.711007999999993]
[107,0,"MS","Jackson",28.009152000000007,37.544351999999996,46.740215999999997]
[108,0,"MS","Meridian",26.646048,35.799239999999998,44.636567999999997]
[109,0,"MT","Billings",60.364007999999998,79.090272000000013,97.031616000000014]
[110,0,"MT","Cut Bank",68.615279999999998,90.506496000000013,109.82829599999998]
[111,0,"MT","Glasgow",82.574880000000007,109.559184,133.53028799999998]
[112,0,"MT","Great Falls",67.408079999999998,88.37248799999999,108.46728]
[113,0,"MT","Helena",62.569776000000005,81.305880000000002,99.628247999999999]
[114,0,"MT","Kalispell",65.484167999999997,85.294775999999999,104.61499199999999]
[115,0,"MT","Lewistown",68.752416000000011,89.297832,109.43438399999999]
[116,0,"MT","Miles City",68.669544000000002,89.492280000000008,110.02128000000002]
[117,0,"MT","Missoula",65.729064000000008,85.729944000000003,104.278728]
[118,0,"NC","Asheville",40.406664000000006,52.797528,64.302624000000009]
[119,0,"NC","Cape Hatteras",29.096952000000002,39.274008000000009,49.046880000000009]
[120,0,"NC","Charlotte",34.469327999999997,46.203167999999998,57.254447999999989]
[121,0,"NC","Greensboro",36.449856000000004,47.642592,58.047360000000005]
[122,0,"NC","Raleigh",31.301688000000002,41.062920000000005,50.147568000000007]
[123,0,"NC","Wilmington",29.195111999999998,39.530087999999999,49.068000000000005]
[124,0,"ND","Bismarck",79.30192799999999,104.479992,127.413312]
[125,0,"ND","Fargo",86.611919999999998,114.30542399999999,141.061992]
[126,0,"ND","Minot",87.025800000000004,114.840288,140.234712]
[127,0,"NE","Grand Island",56.035536000000008,73.768199999999993,90.877943999999999]
[128,0,"NE","Norfolk",65.198304000000007,86.054112000000003,105.087744]
[129,{"$f":"IF(C132=activestate,IF(D132=C$2,1,0),0)","v":0},"NE","North Platte",56.944872000000004,74.91676799999999,92.222015999999996]
[130,0,"NE","Omaha",52.580975999999993,69.366624000000002,84.650376000000009]
[131,0,"NE","Scottsbluff",52.205976000000007,68.563704000000001,83.415071999999995]
[132,0,"NH","Concord",64.254647999999989,84.529176000000007,102.91884000000002]
[133,0,"NJ","Atlantic City",48.910775999999998,63.787776000000001,77.599751999999995]
[134,0,"NJ","Newark",50.784192000000004,66.273383999999993,80.643480000000011]
[135,0,"NM","Albuquerque",34.750392000000005,45.321936000000008,55.157591999999994]
[136,0,"NM","Tucumcari",33.270479999999999,43.535088000000002,53.100599999999993]
[137,0,"NV","Elko",51.826391999999998,67.353912000000008,82.573391999999998]
[138,0,"NV","Ely",57.210144,74.61602400000001,90.395904000000002]
[139,0,"NV","Las Vegas",23.665008,32.103168000000004,40.077239999999996]
[140,0,"NV","Reno",39.436775999999995,51.990503999999994,63.403151999999999]
[141,0,"NV","Tonopah",39.820272000000003,51.779567999999998,63.579215999999995]
[142,0,"NV","Winnemucca",46.267176000000006,60.770040000000009,73.943904000000003]
[143,0,"NY","Albany",62.246447999999994,81.171551999999991,99.798047999999994]
[144,0,"NY","Binghamton",64.550087999999988,84.05522400000001,103.19776800000002]
[145,0,"NY","Buffalo",62.513232000000002,82.422600000000003,100.49006399999999]
[146,0,"NY","Massena",76.433855999999992,99.817968000000008,122.88163200000001]
[147,0,"NY","New York City",50.005871999999997,65.646168000000003,79.771079999999998]
[148,0,"NY","Rochester",61.047480000000007,80.502287999999993,99.164496]
[149,0,"NY","Syracuse",62.843136000000001,82.881095999999999,101.09016]
[150,0,"OH","Akron",54.355440000000002,71.610839999999996,88.146383999999998]
[151,0,"OH","Cleveland",56.729904000000005,74.830991999999995,91.282775999999998]
[152,0,"OH","Columbus",51.573983999999989,68.097768000000002,83.113439999999997]
[153,0,"OH","Dayton",54.34523999999999,71.683103999999986,87.425903999999989]
[154,0,"OH","Mansfield",59.117111999999999,77.395943999999986,95.393519999999995]
[155,0,"OH","Toledo",60.366095999999999,78.909887999999995,97.180080000000004]
[156,0,"OH","Youngstown",61.321056000000013,80.93244,99.731784000000005]
[157,0,"OK","Oklahoma City",42.896736000000004,57.74916000000001,72.070679999999996]
[158,0,"OK","Tulsa",42.857064000000001,57.778752000000004,72.157584]
[159,0,"OR","Astoria",31.410263999999998,41.092895999999996,49.675584000000001]
[160,0,"OR","Eugene",34.74024,45.394224000000008,55.205472]
[161,0,"OR","Medford",39.751632000000001,52.113191999999998,62.982743999999997]
[162,0,"OR","North Bend",23.013168,29.792591999999999,36.351383999999996]
[163,0,"OR","Pendleton",44.462687999999993,58.489128000000008,71.163408000000004]
[164,0,"OR","Portland",36.322704000000002,47.934359999999998,58.376303999999998]
[165,0,"OR","Redmond",48.436368000000009,63.033744000000006,76.588104000000001]
[166,0,"OR","Salem",36.586944000000003,47.818896000000002,58.197551999999995]
[167,0,"PA","Allentown",55.455455999999998,72.332927999999995,88.042079999999999]
[168,0,"PA","Bradford",69.942815999999993,91.289423999999997,111.15386400000001]
[169,0,"PA","Erie",65.967216000000008,87.129648000000003,106.38873599999998]
[170,0,"PA","Harrisburg",46.221383999999993,60.797567999999991,74.009544000000005]
[171,0,"PA","Philadelphia ",49.990296000000001,65.709312000000011,79.937207999999998]
[172,0,"PA","Pittsburgh",53.840615999999997,71.02879200000001,86.639712000000003]
[173,0,"PA","Wilkes-Barre ",57.530184000000006,75.669479999999993,92.096351999999996]
[174,0,"PA","Williamsport ",52.247664,68.80368,83.805167999999995]
[175,0,"RI","Providence",52.454328000000004,68.788175999999993,84.457056000000009]
[176,0,"SC","Charleston",25.988616,35.100816000000002,44.079167999999996]
[177,0,"SC","Columbia",28.496976,38.487839999999998,47.531064000000008]
[178,0,"SC","Greenville",34.385280000000002,46.103568000000003,57.129264000000013]
[179,0,"SD","Huron",76.019760000000005,100.111368,123.32848799999999]
[180,0,"SD","Pierre",65.182079999999999,85.813152000000002,104.57959200000002]
[181,0,"SD","Rapid City",60.722712000000016,79.839552000000026,97.21332000000001]
[182,0,"SD","Sioux Falls",71.137703999999999,93.619271999999995,115.24907999999999]
[183,0,"TN","Bristol",37.724736,49.360751999999998,60.140951999999999]
[184,0,"TN","Chattanooga",31.879703999999997,41.856960000000001,51.126792000000009]
[185,0,"TN","Knoxville",33.765312000000002,43.902791999999998,53.554728000000004]
[186,0,"TN","Memphis",34.006943999999997,45.567311999999994,56.949024000000001]
[187,0,"TN","Nashville",37.762391999999998,49.559135999999995,60.570959999999999]
[188,0,"TX","Abilene",32.092656000000005,43.524048000000001,54.560543999999993]
[189,0,"TX","Amarillo",44.216856,58.174152000000007,71.564136000000019]
[190,0,"TX","Austin",21.523727999999998,29.338367999999999,36.731520000000003]
[191,0,"TX","Brownsville",13.144080000000001,18.119399999999999,23.012904000000002]
[192,0,"TX","Corpus Christi",15.357168,21.275063999999997,26.757072000000001]
[193,{"$f":"IF(C196=activestate,IF(D196=C$2,1,0),0)","v":0},"TX","El Paso",24.154536,33.019056000000006,41.253360000000001]
[194,0,"TX","Fort Worth",27.312575999999996,36.776663999999997,46.092144000000005]
[195,0,"TX","Houston",19.807152000000002,27.063744,33.936648000000005]
[196,0,"TX","Lubbock",37.668168000000001,50.846232000000001,63.038184000000001]
[197,0,"TX","Lufkin",24.164928000000003,33.010584000000001,41.393087999999999]
[198,0,"TX","Midland",30.533472000000003,41.482320000000001,51.628127999999997]
[199,0,"TX","San Angelo",32.623511999999998,44.254151999999998,55.024559999999994]
[200,0,"TX","Victoria",16.445376,22.529039999999998,28.525584000000002]
[201,0,"TX","Waco",27.388343999999996,37.468319999999999,47.208792000000003]
[202,0,"TX","Wichita Falls",38.54712,52.163184000000001,64.768224000000004]
[203,1,"US",null,49.469595263157885,65.263807999999955,80.04382378947372]
[204,0,"UT","Cedar City",43.593119999999999,56.616816,68.737176000000005]
[205,0,"UT","Salt Lake City",44.005344000000008,57.794423999999999,70.264199999999988]
[206,0,"VA","Lynchburg",39.168864000000006,51.492672000000006,62.641343999999989]
[207,0,"VA","Norfolk",32.913143999999996,43.402824000000003,52.879296000000011]
[208,0,"VA","Richmond",34.488624000000002,45.464592000000003,55.407768000000019]
[209,0,"VA","Roanoke",39.257040000000003,51.707207999999994,62.977488000000001]
[210,0,"VA","Sterling",50.067575999999988,65.946408000000005,80.356704000000008]
[211,0,"VT","Burlington",70.032960000000003,92.243471999999997,113.56759199999999]
[212,0,"WA","Olympia",42.373583999999994,55.387535999999997,68.060352000000009]
[213,0,"WA","Quillayute",36.172008000000005,47.008344000000001,57.478992000000005]
[214,0,"WA","Seattle",37.623503999999997,49.476527999999995,60.090984000000006]
[215,0,"WA","Spokane",55.130375999999991,72.41234399999999,88.054128000000006]
[216,0,"WA","Yakima",48.388151999999998,63.295344,77.162447999999998]
[217,0,"WI","Eau Claire",77.629103999999998,102.200472,125.79804]
[218,0,"WI","Green Bay",76.195463999999987,100.31606400000001,123.49027199999999]
[219,0,"WI","La Crosse",68.448792000000012,90.176423999999997,109.94296800000001]
[220,0,"WI","Madison",65.382815999999991,85.965095999999988,105.71018400000003]
[221,0,"WI","Milwaukee",68.645784000000006,90.305256,109.96339200000001]
[222,0,"WV","Charleston",42.644831999999994,55.929959999999994,68.273183999999986]
[223,0,"WV","Elkins",52.430064000000002,68.614848000000009,83.676216000000011]
[224,0,"WV","Huntington",43.979256000000007,57.649992000000005,70.355832000000007]
[225,0,"WY","Casper",63.309023999999994,83.322528000000005,101.97026399999999]
[226,0,"WY","Cheyenne",55.74148799999999,72.559944000000002,88.626623999999993]
[227,0,"WY","Lander",53.530968000000001,70.106232000000006,85.479960000000005]
[228,0,"WY","Rock Springs ",64.767335999999986,84.203952000000001,101.73938399999999]
[229,0,"WY","Sheridan",58.832975999999988,77.031695999999997,93.517656000000017]
[230,0,"AB",null,60.364007999999998,79.090272000000013,97.031616000000014,"Billings, MT"]
[231,0,"BC",null,37.623503999999997,49.476527999999995,60.090984000000006,"Seattle, WA"]
[232,0,"MB",null,76.195463999999987,100.31606400000001,123.49027199999999,"Green Bay, WI"]
[233,0,"NB",null,61.914263999999996,81.157488000000015,98.565888000000001,"Portland, ME"]
[234,0,"NF",null,89.101272000000009,117.44049599999998,144.55022399999999,"Anchorage, AK"]
[235,0,"NS",null,61.914263999999996,81.157488000000015,98.565888000000001,"Portland, ME"]
[236,0,"ON",null,64.708631999999994,84.684767999999991,104.37722400000003,"Lansing, MI"]
[237,0,"PE",null,61.914263999999996,81.157488000000015,98.565888000000001,"Portland, ME"]
[238,0,"QB",null,61.914263999999996,81.157488000000015,98.565888000000001,"Portland, ME"]
[239,0,"SK",null,86.611919999999998,114.30542399999999,141.061992,"Fargo, ND"]
[240,0,"Canada Avg.",null,66.23,86.99,106.49]

{"sheet":"Adjusted HSPF","index":3,"n_rows":246,"n_cols":14,"rows_kept":246,"cut":false,"hidden":false,"merged":[[3,4,3,6],[4,4,4,6]]}
[null,null,null,"HSPF","7.5 HSPF2","7.8 HSPF2","9 HSPF2"]
[null,{"$f":"activestate","v":"US"},{"$f":"LOOKUP(city,Lists!G119:G133,Lists!H119:H133)","v":""},null,{"$f":"VLOOKUP(1,B7:E246,4,0)","v":6.7278185050535928},{"$f":"VLOOKUP(1,B7:F246,5,0)","v":6.8949319540895111},{"$f":"VLOOKUP(1,B7:G246,6,0)","v":7.6689391992691007}]
[null,null,null,null,null,null,null,null,null,"*values in row 6 are calculated HSPF based on HSPF2 values in row 1"]
[null,null,null,null,"  Adjusted HSPF when"]
[null,null,null,null,"      rated HSPF is:"]
[null,null,"State","City",8.8000000000000007,9.1,10.6,"ASHRAE Design Temp",null,null,"HSPF2",7.5,7.8,9]
[1,{"$f":"IF(C7=activestate,IF(D7='Heating Load'!C$2,1,0),0)","v":0},"AK","Anchorage",{"$f":"+E$6-(E$6*((0.1392+(-0.00846*$H7)+(-0.0001074*$H7^2)+(0.0228*E$6))))","v":5.15944},{"$f":"+F$6-(F$6*((0.1392+(-0.00846*$H7)+(-0.0001074*$H7^2)+(0.0228*F$6))))","v":5.2730859999999993},5.7797559999999999,-10,null,null,"HSPF",{"$f":"L6/0.85","v":8.8235294117647065},{"$f":"M6/0.85","v":9.1764705882352935},10.588235294117647]
[2,{"$f":"IF(C8=activestate,IF(D8='Heating Load'!C$2,1,0),0)","v":0},"AK","Annette",7.3481636800000008,7.5364252599999997,8.4161731599999996,17]
[3,{"$f":"IF(C9=activestate,IF(D9='Heating Load'!C$2,1,0),0)","v":0},"AK","Bethel",4.5670451200000004,4.6604958399999994,5.0661894399999996,-24]
[4,{"$f":"IF(C10=activestate,IF(D10='Heating Load'!C$2,1,0),0)","v":0},"AK","Big Delta",4.3434635200000002,4.4292921399999994,4.7968752399999994,-39]
[5,{"$f":"IF(C11=activestate,IF(D11='Heating Load'!C$2,1,0),0)","v":0},"AK","Cold Bay",6.6484000000000005,6.8128060000000001,7.5732759999999999,10]
[6,{"$f":"IF(C12=activestate,IF(D12='Heating Load'!C$2,1,0),0)","v":0},"AK","Fairbanks",4.3541555199999999,4.4403486399999998,4.8097542400000002,-36]
[7,{"$f":"IF(C13=activestate,IF(D13='Heating Load'!C$2,1,0),0)","v":0},"AK","Gulkana",4.3434635200000002,4.4292921399999994,4.7968752399999994,-39]
[8,{"$f":"IF(C14=activestate,IF(D14='Heating Load'!C$2,1,0),0)","v":0},"AK","King Salmon",4.7360843200000007,4.8352977399999997,5.2698048399999999,-19]
[9,{"$f":"IF(C15=activestate,IF(D15='Heating Load'!C$2,1,0),0)","v":0},"AK","Kodiak",6.8388812800000007,7.0097809599999996,7.8027193600000002,12]
[10,{"$f":"IF(C16=activestate,IF(D16='Heating Load'!C$2,1,0),0)","v":0},"AK","McGrath",4.3497836800000007,4.4358277600000005,4.80448816,-42]
[11,{"$f":"IF(C17=activestate,IF(D17='Heating Load'!C$2,1,0),0)","v":0},"AK","Nome",4.5126611200000006,4.6042578399999998,5.0006814400000001,-26]
[12,{"$f":"IF(C18=activestate,IF(D18='Heating Load'!C$2,1,0),0)","v":0},"AK","St Paul Island",6.0412580800000004,6.1849660599999998,6.8419459600000003,3]
[13,{"$f":"IF(C19=activestate,IF(D19='Heating Load'!C$2,1,0),0)","v":0},"AK","Talkeetna",4.66279792,4.7595129399999996,5.1815280399999999,-21]
[14,{"$f":"IF(C20=activestate,IF(D20='Heating Load'!C$2,1,0),0)","v":0},"AK","Yakutat",5.9620844800000006,6.1030933599999999,6.7465777600000001,2]
[15,{"$f":"IF(C21=activestate,IF(D21='Heating Load'!C$2,1,0),0)","v":0},"AL","Birmingham",8.0216804800000006,8.2329028599999994,9.2274547600000005,23]
[16,{"$f":"IF(C22=activestate,IF(D22='Heating Load'!C$2,1,0),0)","v":0},"AL","Huntsville",7.6764160000000006,7.8758679999999996,8.8115679999999994,20]
[17,{"$f":"IF(C23=activestate,IF(D23='Heating Load'!C$2,1,0),0)","v":0},"AL","Mobile",8.8934560000000005,{"$f":"+F$6-(F$6*((0.1392+(-0.00846*$H23)+(-0.0001074*$H23^2)+(0.0228*F$6))))","v":9.1343979999999991},{"$f":"+G$6-(G$6*((0.1392+(-0.00846*$H23)+(-0.0001074*$H23^2)+(0.0228*G$6))))","v":10.277547999999999},30]
[18,{"$f":"IF(C24=activestate,IF(D24='Heating Load'!C$2,1,0),0)","v":0},"AL","Montgomery",{"$f":"+E$6-(E$6*((0.1392+(-0.00846*$H24)+(-0.0001074*$H24^2)+(0.0228*E$6))))","v":8.5084964800000016},8.7363148600000002,9.8138467600000006,27]
[19,{"$f":"IF(C25=activestate,IF(D25='Heating Load'!C$2,1,0),0)","v":0},"AR","Fort Smith",7.5651083200000011,7.7607657400000001,8.6774928399999993,19]
[20,{"$f":"IF(C26=activestate,IF(D26='Heating Load'!C$2,1,0),0)","v":0},"AR","Little Rock",7.7896139200000007,7.99292494,8.9479200399999996,21]
[21,{"$f":"IF(C27=activestate,IF(D27='Heating Load'!C$2,1,0),0)","v":0},"AZ","Flagstaff",6.4654796799999996,6.6236497599999993,7.3529401599999993,8]
[22,{"$f":"IF(C28=activestate,IF(D28='Heating Load'!C$2,1,0),0)","v":0},"AZ","Phoenix",9.9302830000000011,10.206571374999999,11.526453249999999,37.5]
[23,{"$f":"IF(C29=activestate,IF(D29='Heating Load'!C$2,1,0),0)","v":0},"AZ","Prescott",7.6764160000000006,7.8758679999999996,8.8115679999999994,20]
[24,{"$f":"IF(C30=activestate,IF(D30='Heating Load'!C$2,1,0),0)","v":0},"AZ","Tucson",9.43319872,9.6925410400000001,10.92769264,34]
[25,{"$f":"IF(C31=activestate,IF(D31='Heating Load'!C$2,1,0),0)","v":0},"CA","Arcata",9.1595468800000006,9.4095601599999998,10.598066559999999,32]
[26,{"$f":"IF(C32=activestate,IF(D32='Heating Load'!C$2,1,0),0)","v":0},"CA","Bakersfield",9.5728600000000004,9.8369634999999995,11.095921000000001,35]
[27,{"$f":"IF(C33=activestate,IF(D33='Heating Load'!C$2,1,0),0)","v":0},"CA","Daggett",9.1595468800000006,9.4095601599999998,10.598066559999999,32]
[28,{"$f":"IF(C34=activestate,IF(D34='Heating Load'!C$2,1,0),0)","v":0},"CA","Fresno",9.1595468800000006,9.4095601599999998,10.598066559999999,32]
[29,{"$f":"IF(C35=activestate,IF(D35='Heating Load'!C$2,1,0),0)","v":0},"CA","Long Beach",10.758198880000002,11.06271166,12.523715559999999,43]
[30,{"$f":"IF(C36=activestate,IF(D36='Heating Load'!C$2,1,0),0)","v":0},"CA","Los Angeles",11.073436000000001,11.388695500000001,12.903433,45]
[31,{"$f":"IF(C37=activestate,IF(D37='Heating Load'!C$2,1,0),0)","v":0},"CA","Sacramento",9.2954276800000013,9.5500732599999996,10.76174116,33]
[32,{"$f":"IF(C38=activestate,IF(D38='Heating Load'!C$2,1,0),0)","v":0},"CA","San Diego",10.914872320000001,11.224726239999999,12.712435839999999,44]
[33,{"$f":"IF(C39=activestate,IF(D39='Heating Load'!C$2,1,0),0)","v":0},"CA","San Francisco",10.150407520000002,10.43420014,11.791603239999999,39]
[34,{"$f":"IF(C40=activestate,IF(D40='Heating Load'!C$2,1,0),0)","v":0},"CA","Santa Maria",9.5728600000000004,9.8369634999999995,11.095921000000001,35]
[35,{"$f":"IF(C41=activestate,IF(D41='Heating Load'!C$2,1,0),0)","v":0},"CO","Alamosa",5.1048395200000005,5.2166241399999995,5.7139872399999998,-11]
[36,{"$f":"IF(C42=activestate,IF(D42='Heating Load'!C$2,1,0),0)","v":0},"CO","Co. Springs",6.122321920000001,6.2687934399999996,6.9395910399999998,4]
[37,{"$f":"IF(C43=activestate,IF(D43='Heating Load'!C$2,1,0),0)","v":0},"CO","Eagle",5.334582880000001,5.4541996600000004,5.9907235600000002,-7]
[38,{"$f":"IF(C44=activestate,IF(D44='Heating Load'!C$2,1,0),0)","v":0},"CO","Pueblo",6.2052760000000013,6.3545754999999993,7.0395129999999995,5]
[39,{"$f":"IF(C45=activestate,IF(D45='Heating Load'!C$2,1,0),0)","v":0},"CT","Bridgeport",6.8388812800000007,7.0097809599999996,7.8027193600000002,12]
[40,{"$f":"IF(C46=activestate,IF(D46='Heating Load'!C$2,1,0),0)","v":0},"CT","Hartford",6.2901203199999998,6.4423122399999997,7.1417118400000001,6]
[41,{"$f":"IF(C47=activestate,IF(D47='Heating Load'!C$2,1,0),0)","v":0},"DC","Washington",7.6764160000000006,7.8758679999999996,8.8115679999999994,20]
[42,{"$f":"IF(C48=activestate,IF(D48='Heating Load'!C$2,1,0),0)","v":0},"DE","Wilmington",7.0369235200000002,7.2145746400000004,8.0412702399999993,14]
[43,{"$f":"IF(C49=activestate,IF(D49='Heating Load'!C$2,1,0),0)","v":0},"FL","Daytona Beach",9.8578532800000005,10.131672459999999,11.439208359999999,37]
[44,{"$f":"IF(C50=activestate,IF(D50='Heating Load'!C$2,1,0),0)","v":0},"FL","Jacksonville ",9.5728600000000004,9.8369634999999995,11.095921000000001,35]
[45,{"$f":"IF(C51=activestate,IF(D51='Heating Load'!C$2,1,0),0)","v":0},"FL","Key West",13.306775680000001,13.698171759999999,15.59359216,58]
[46,{"$f":"IF(C52=activestate,IF(D52='Heating Load'!C$2,1,0),0)","v":0},"FL","Miami",11.81036428,12.150746334999999,13.79109661,49.5]
[47,{"$f":"IF(C53=activestate,IF(D53='Heating Load'!C$2,1,0),0)","v":0},"FL","Tallahassee",8.6349260800000014,8.8670545599999997,9.96613696,28]
[48,{"$f":"IF(C54=activestate,IF(D54='Heating Load'!C$2,1,0),0)","v":0},"FL","Tampa",10.299520000000001,10.588395999999999,11.971216,40]
[49,{"$f":"IF(C55=activestate,IF(D55='Heating Load'!C$2,1,0),0)","v":0},"FL","W. Palm Beach",11.396234080000001,11.722498059999999,13.292257960000001,47]
[50,{"$f":"IF(C56=activestate,IF(D56='Heating Load'!C$2,1,0),0)","v":0},"GA","Athens",8.2613080000000014,8.4806995000000001,9.5160970000000002,25]
[51,{"$f":"IF(C57=activestate,IF(D57='Heating Load'!C$2,1,0),0)","v":0},"GA","Atlanta",8.0216804800000006,8.2329028599999994,9.2274547600000005,23]
[52,{"$f":"IF(C58=activestate,IF(D58='Heating Load'!C$2,1,0),0)","v":0},"GA","Augusta",8.2613080000000014,8.4806995000000001,9.5160970000000002,25]
[53,{"$f":"IF(C59=activestate,IF(D59='Heating Load'!C$2,1,0),0)","v":0},"GA","Columbus",8.5084964800000016,8.7363148600000002,9.8138467600000006,27]
[54,{"$f":"IF(C60=activestate,IF(D60='Heating Load'!C$2,1,0),0)","v":0},"GA","Macon",8.5084964800000016,8.7363148600000002,9.8138467600000006,27]
[55,{"$f":"IF(C61=activestate,IF(D61='Heating Load'!C$2,1,0),0)","v":0},"GA","Savannah",8.763245920000001,8.9997489399999999,10.12070404,29]
[56,{"$f":"IF(C62=activestate,IF(D62='Heating Load'!C$2,1,0),0)","v":0},"HI","Hilo",14.250813280000003,14.67439246,16.730728360000001,63]
[57,{"$f":"IF(C63=activestate,IF(D63='Heating Load'!C$2,1,0),0)","v":0},"HI","Honolulu",14.250813280000003,14.67439246,16.730728360000001,63]
[58,{"$f":"IF(C64=activestate,IF(D64='Heating Load'!C$2,1,0),0)","v":0},"HI","Kahului",13.867527520000001,14.27804014,16.269043240000002,61]
[59,{"$f":"IF(C65=activestate,IF(D65='Heating Load'!C$2,1,0),0)","v":0},"HI","Lihue",14.05822528,14.475238959999999,16.498747359999999,62]
[60,{"$f":"IF(C66=activestate,IF(D66='Heating Load'!C$2,1,0),0)","v":0},"IA","Des Moines",5.5267379200000004,5.6529054399999996,6.22218304,-4]
[61,{"$f":"IF(C67=activestate,IF(D67='Heating Load'!C$2,1,0),0)","v":0},"IA","Mason City",5.15944,5.2730859999999993,5.7797559999999999,-10]
[62,{"$f":"IF(C68=activestate,IF(D68='Heating Load'!C$2,1,0),0)","v":0},"IA","Sioux City",5.3967443199999998,5.5184802400000006,6.06559984,-6]
[63,{"$f":"IF(C69=activestate,IF(D69='Heating Load'!C$2,1,0),0)","v":0},"IA","Waterloo",5.2159307200000011,5.3315025400000007,5.8478016400000001,-9]
[64,{"$f":"IF(C70=activestate,IF(D70='Heating Load'!C$2,1,0),0)","v":0},"ID","Boise",6.5559947200000002,6.7172505400000002,7.4619696399999995,9]
[65,{"$f":"IF(C71=activestate,IF(D71='Heating Load'!C$2,1,0),0)","v":0},"ID","Pocatello",5.8094080000000003,5.9452119999999997,6.5626720000000001,0]
[66,{"$f":"IF(C72=activestate,IF(D72='Heating Load'!C$2,1,0),0)","v":0},"IL","Chicago",5.8848011200000006,6.0231753399999999,6.65348644,1]
[67,{"$f":"IF(C73=activestate,IF(D73='Heating Load'!C$2,1,0),0)","v":0},"IL","Moline",5.5945700800000004,5.7230500600000003,6.3038899599999993,-3]
[68,{"$f":"IF(C74=activestate,IF(D74='Heating Load'!C$2,1,0),0)","v":0},"IL","Peoria",5.7359051200000009,5.8692033400000003,6.4741344400000003,-1]
[69,{"$f":"IF(C75=activestate,IF(D75='Heating Load'!C$2,1,0),0)","v":0},"IL","Rockford",5.5267379200000004,5.6529054399999996,6.22218304,-4]
[70,{"$f":"IF(C76=activestate,IF(D76='Heating Load'!C$2,1,0),0)","v":0},"IL","Springfield",5.9620844800000006,6.1030933599999999,6.7465777600000001,2]
[71,{"$f":"IF(C77=activestate,IF(D77='Heating Load'!C$2,1,0),0)","v":0},"IN","Evansville",6.5559947200000002,6.7172505400000002,7.4619696399999995,9]
[72,{"$f":"IF(C78=activestate,IF(D78='Heating Load'!C$2,1,0),0)","v":0},"IN","Fort Wayne",5.9620844800000006,6.1030933599999999,6.7465777600000001,2]
[73,{"$f":"IF(C79=activestate,IF(D79='Heating Load'!C$2,1,0),0)","v":0},"IN","Indianapolis ",6.0412580800000004,6.1849660599999998,6.8419459600000003,3]
[74,{"$f":"IF(C80=activestate,IF(D80='Heating Load'!C$2,1,0),0)","v":0},"KS","Dodge City",6.2901203199999998,6.4423122399999997,7.1417118400000001,6]
[75,{"$f":"IF(C81=activestate,IF(D81='Heating Load'!C$2,1,0),0)","v":0},"KS","Goodland",5.9620844800000006,6.1030933599999999,6.7465777600000001,2]
[76,{"$f":"IF(C82=activestate,IF(D82='Heating Load'!C$2,1,0),0)","v":0},"KS","Topeka",6.122321920000001,6.2687934399999996,6.9395910399999998,4]
[77,{"$f":"IF(C83=activestate,IF(D83='Heating Load'!C$2,1,0),0)","v":0},"KS","Wichita",6.5559947200000002,6.7172505400000002,7.4619696399999995,9]
[78,{"$f":"IF(C84=activestate,IF(D84='Heating Load'!C$2,1,0),0)","v":0},"KY","Covington",6.3768548800000007,6.53200366,7.2461875599999992,7]
[79,{"$f":"IF(C85=activestate,IF(D85='Heating Load'!C$2,1,0),0)","v":0},"KY","Lexington",6.6484000000000005,6.8128060000000001,7.5732759999999999,10]
[80,{"$f":"IF(C86=activestate,IF(D86='Heating Load'!C$2,1,0),0)","v":0},"KY","Louisville",6.8388812800000007,7.0097809599999996,7.8027193600000002,12]
[81,{"$f":"IF(C87=activestate,IF(D87='Heating Load'!C$2,1,0),0)","v":0},"LA","Baton Rouge",8.8934560000000005,9.1343979999999991,10.277547999999999,30]
[82,{"$f":"IF(C88=activestate,IF(D88='Heating Load'!C$2,1,0),0)","v":0},"LA","Lake Charles ",{"$f":"+E$6-(E$6*((0.1392+(-0.00846*$H88)+(-0.0001074*$H88^2)+(0.0228*E$6))))","v":9.1595468800000006},9.4095601599999998,10.598066559999999,32]
[83,{"$f":"IF(C89=activestate,IF(D89='Heating Load'!C$2,1,0),0)","v":0},"LA","New Orleans",9.7858961200000003,10.057262215,11.35253269,36.5]
[84,{"$f":"IF(C90=activestate,IF(D90='Heating Load'!C$2,1,0),0)","v":0},"LA","Shreveport",8.3839571199999998,8.6075298399999998,9.6638334399999994,26]
[85,{"$f":"IF(C91=activestate,IF(D91='Heating Load'!C$2,1,0),0)","v":0},"MA","Boston",6.8388812800000007,7.0097809599999996,7.8027193600000002,12]
[86,{"$f":"IF(C92=activestate,IF(D92='Heating Load'!C$2,1,0),0)","v":0},"MA","Worcester",6.2052760000000013,6.3545754999999993,7.0395129999999995,5]
[87,{"$f":"IF(C93=activestate,IF(D93='Heating Load'!C$2,1,0),0)","v":0},"MD","Baltimore",7.1387800000000006,7.3199034999999997,8.1639610000000005,15]
[88,{"$f":"IF(C94=activestate,IF(D94='Heating Load'!C$2,1,0),0)","v":0},"ME","Caribou",5.15944,5.2730859999999993,5.7797559999999999,-10]
[89,{"$f":"IF(C95=activestate,IF(D95='Heating Load'!C$2,1,0),0)","v":0},"ME","Portland",5.9620844800000006,6.1030933599999999,6.7465777600000001,2]
[90,{"$f":"IF(C96=activestate,IF(D96='Heating Load'!C$2,1,0),0)","v":0},"MI","Alpena",5.7359051200000009,5.8692033400000003,6.4741344400000003,-1]
[91,{"$f":"IF(C97=activestate,IF(D97='Heating Load'!C$2,1,0),0)","v":0},"MI","Detroit",6.2052760000000013,6.3545754999999993,7.0395129999999995,5]
[92,{"$f":"IF(C98=activestate,IF(D98='Heating Load'!C$2,1,0),0)","v":0},"MI","Flint",6.0412580800000004,6.1849660599999998,6.8419459600000003,3]
[93,{"$f":"IF(C99=activestate,IF(D99='Heating Load'!C$2,1,0),0)","v":0},"MI","Grand Rapids ",6.2052760000000013,6.3545754999999993,7.0395129999999995,5]
[94,{"$f":"IF(C100=activestate,IF(D100='Heating Load'!C$2,1,0),0)","v":0},"MI","Lansing",5.9620844800000006,6.1030933599999999,6.7465777600000001,2]
[95,{"$f":"IF(C101=activestate,IF(D101='Heating Load'!C$2,1,0),0)","v":0},"MI","Muskegon",6.3768548800000007,6.53200366,7.2461875599999992,7]
[96,{"$f":"IF(C102=activestate,IF(D102='Heating Load'!C$2,1,0),0)","v":0},"MI","Sault St Marie",5.334582880000001,5.4541996600000004,5.9907235600000002,-7]
[97,{"$f":"IF(C103=activestate,IF(D103='Heating Load'!C$2,1,0),0)","v":0},"MI","Traverse City",5.9620844800000006,6.1030933599999999,6.7465777600000001,2]
[98,{"$f":"IF(C104=activestate,IF(D104='Heating Load'!C$2,1,0),0)","v":0},"MN","Duluth",4.8601907200000003,4.9636350399999998,5.4192966399999998,-16]
[99,{"$f":"IF(C105=activestate,IF(D105='Heating Load'!C$2,1,0),0)","v":0},"MN","Int. Falls",4.5970724800000005,4.6915468599999999,5.1023587599999995,-23]
[100,{"$f":"IF(C106=activestate,IF(D106='Heating Load'!C$2,1,0),0)","v":0},"MN","Minneapolis",5.1048395200000005,5.2166241399999995,5.7139872399999998,-11]
[101,{"$f":"IF(C107=activestate,IF(D107='Heating Load'!C$2,1,0),0)","v":0},"MN","Rochester",5.0521292800000008,5.1621169600000005,5.6504953599999999,-12]
[102,{"$f":"IF(C108=activestate,IF(D108='Heating Load'!C$2,1,0),0)","v":0},"MN","Saint Cloud",4.9523795200000009,5.0589666400000004,5.5303422400000004,-14]
[103,{"$f":"IF(C109=activestate,IF(D109='Heating Load'!C$2,1,0),0)","v":0},"MO","Columbia",6.2052760000000013,6.3545754999999993,7.0395129999999995,5]
[104,{"$f":"IF(C110=activestate,IF(D110='Heating Load'!C$2,1,0),0)","v":0},"MO","Kansas City",6.122321920000001,6.2687934399999996,6.9395910399999998,4]
[105,{"$f":"IF(C111=activestate,IF(D111='Heating Load'!C$2,1,0),0)","v":0},"MO","Springfield",6.5559947200000002,6.7172505400000002,7.4619696399999995,9]
[106,{"$f":"IF(C112=activestate,IF(D112='Heating Load'!C$2,1,0),0)","v":0},"MO","St. Louis",6.4654796799999996,6.6236497599999993,7.3529401599999993,8]
[107,{"$f":"IF(C113=activestate,IF(D113='Heating Load'!C$2,1,0),0)","v":0},"MS","Jackson",8.2613080000000014,8.4806995000000001,9.5160970000000002,25]
[108,{"$f":"IF(C114=activestate,IF(D114='Heating Load'!C$2,1,0),0)","v":0},"MS","Meridian",8.2613080000000014,8.4806995000000001,9.5160970000000002,25]
[109,{"$f":"IF(C115=activestate,IF(D115='Heating Load'!C$2,1,0),0)","v":0},"MT","Billings",5.334582880000001,5.4541996600000004,5.9907235600000002,-7]
[110,{"$f":"IF(C116=activestate,IF(D116='Heating Load'!C$2,1,0),0)","v":0},"MT","Cut Bank",4.8601907200000003,4.9636350399999998,5.4192966399999998,-16]
[111,{"$f":"IF(C117=activestate,IF(D117='Heating Load'!C$2,1,0),0)","v":0},"MT","Glasgow",4.8169316799999997,4.9189012599999993,5.3671891599999997,-17]
[112,{"$f":"IF(C118=activestate,IF(D118='Heating Load'!C$2,1,0),0)","v":0},"MT","Great Falls",5.0521292800000008,5.1621169600000005,5.6504953599999999,-12]
[113,{"$f":"IF(C119=activestate,IF(D119='Heating Load'!C$2,1,0),0)","v":0},"MT","Helena",5.15944,5.2730859999999993,5.7797559999999999,-10]
[114,{"$f":"IF(C120=activestate,IF(D120='Heating Load'!C$2,1,0),0)","v":0},"MT","Kalispell",5.5945700800000004,5.7230500600000003,6.3038899599999993,-3]
[115,{"$f":"IF(C121=activestate,IF(D121='Heating Load'!C$2,1,0),0)","v":0},"MT","Lewistown",5.0521292800000008,5.1621169600000005,5.6504953599999999,-12]
[116,{"$f":"IF(C122=activestate,IF(D122='Heating Load'!C$2,1,0),0)","v":0},"MT","Miles City",5.0013092800000001,5.1095644599999996,5.5892803599999992,-13]
[117,{"$f":"IF(C123=activestate,IF(D123='Heating Load'!C$2,1,0),0)","v":0},"MT","Missoula",5.7359051200000009,5.8692033400000003,6.4741344400000003,-1]
[118,{"$f":"IF(C124=activestate,IF(D124='Heating Load'!C$2,1,0),0)","v":0},"NC","Asheville",7.2425267200000008,7.4271870399999997,8.28892864,16]
[119,{"$f":"IF(C125=activestate,IF(D125='Heating Load'!C$2,1,0),0)","v":0},"NC","Cape Hatteras",8.763245920000001,8.9997489399999999,10.12070404,29]
[120,{"$f":"IF(C126=activestate,IF(D126='Heating Load'!C$2,1,0),0)","v":0},"NC","Charlotte",8.0216804800000006,8.2329028599999994,9.2274547600000005,23]
[121,{"$f":"IF(C127=activestate,IF(D127='Heating Load'!C$2,1,0),0)","v":0},"NC","Greensboro",7.5651083200000011,7.7607657400000001,8.6774928399999993,19]
[122,{"$f":"IF(C128=activestate,IF(D128='Heating Load'!C$2,1,0),0)","v":0},"NC","Raleigh",7.6764160000000006,7.8758679999999996,8.8115679999999994,20]
[123,{"$f":"IF(C129=activestate,IF(D129='Heating Load'!C$2,1,0),0)","v":0},"NC","Wilmington",8.5084964800000016,8.7363148600000002,9.8138467600000006,27]
[124,{"$f":"IF(C130=activestate,IF(D130='Heating Load'!C$2,1,0),0)","v":0},"ND","Bismarck",4.8601907200000003,4.9636350399999998,5.4192966399999998,-16]
[125,{"$f":"IF(C131=activestate,IF(D131='Heating Load'!C$2,1,0),0)","v":0},"ND","Fargo",4.8169316799999997,4.9189012599999993,5.3671891599999997,-17]
[126,{"$f":"IF(C132=activestate,IF(D132='Heating Load'!C$2,1,0),0)","v":0},"ND","Minot",4.8601907200000003,4.9636350399999998,5.4192966399999998,-16]
[127,{"$f":"IF(C133=activestate,IF(D133='Heating Load'!C$2,1,0),0)","v":0},"NE","Grand Island",5.6642924800000003,5.7951493599999999,6.3878737599999997,-2]
[128,{"$f":"IF(C134=activestate,IF(D134='Heating Load'!C$2,1,0),0)","v":0},"NE","Norfolk",5.4607960000000002,5.5847154999999997,6.1427529999999999,-5]
[129,{"$f":"IF(C135=activestate,IF(D135='Heating Load'!C$2,1,0),0)","v":0},"NE","North Platte",5.5267379200000004,5.6529054399999996,6.22218304,-4]
[130,{"$f":"IF(C136=activestate,IF(D136='Heating Load'!C$2,1,0),0)","v":0},"NE","Omaha",5.6642924800000003,5.7951493599999999,6.3878737599999997,-2]
[131,{"$f":"IF(C137=activestate,IF(D137='Heating Load'!C$2,1,0),0)","v":0},"NE","Scottsbluff",5.5945700800000004,5.7230500600000003,6.3038899599999993,-3]
[132,{"$f":"IF(C138=activestate,IF(D138='Heating Load'!C$2,1,0),0)","v":0},"NH","Concord",5.6642924800000003,5.7951493599999999,6.3878737599999997,-2]
[133,{"$f":"IF(C139=activestate,IF(D139='Heating Load'!C$2,1,0),0)","v":0},"NJ","Atlantic City",6.9369572800000006,7.1112004600000001,7.9208563600000002,13]
[134,{"$f":"IF(C140=activestate,IF(D140='Heating Load'!C$2,1,0),0)","v":0},"NJ","Newark",7.0369235200000002,7.2145746400000004,8.0412702399999993,14]
[135,{"$f":"IF(C141=activestate,IF(D141='Heating Load'!C$2,1,0),0)","v":0},"NM","Albuquerque",7.4556908800000006,7.6476181600000004,8.5456945599999994,18]
[136,{"$f":"IF(C142=activestate,IF(D142='Heating Load'!C$2,1,0),0)","v":0},"NM","Tucumcari",7.1387800000000006,7.3199034999999997,8.1639610000000005,15]
[137,{"$f":"IF(C143=activestate,IF(D143='Heating Load'!C$2,1,0),0)","v":0},"NV","Elko",5.8848011200000006,6.0231753399999999,6.65348644,1]
[138,{"$f":"IF(C144=activestate,IF(D144='Heating Load'!C$2,1,0),0)","v":0},"NV","Ely",5.8094080000000003,5.9452119999999997,6.5626720000000001,0]
[139,{"$f":"IF(C145=activestate,IF(D145='Heating Load'!C$2,1,0),0)","v":0},"NV","Las Vegas",8.8934560000000005,9.1343979999999991,10.277547999999999,30]
[140,{"$f":"IF(C146=activestate,IF(D146='Heating Load'!C$2,1,0),0)","v":0},"NV","Reno",6.9369572800000006,7.1112004600000001,7.9208563600000002,13]
[141,{"$f":"IF(C147=activestate,IF(D147='Heating Load'!C$2,1,0),0)","v":0},"NV","Tonopah",6.9369572800000006,7.1112004600000001,7.9208563600000002,13]
[142,{"$f":"IF(C148=activestate,IF(D148='Heating Load'!C$2,1,0),0)","v":0},"NV","Winnemucca",6.3768548800000007,6.53200366,7.2461875599999992,7]
[143,{"$f":"IF(C149=activestate,IF(D149='Heating Load'!C$2,1,0),0)","v":0},"NY","Albany",5.6642924800000003,5.7951493599999999,6.3878737599999997,-2]
[144,{"$f":"IF(C150=activestate,IF(D150='Heating Load'!C$2,1,0),0)","v":0},"NY","Binghamton",5.9620844800000006,6.1030933599999999,6.7465777600000001,2]
[145,{"$f":"IF(C151=activestate,IF(D151='Heating Load'!C$2,1,0),0)","v":0},"NY","Buffalo",6.2052760000000013,6.3545754999999993,7.0395129999999995,5]
[146,{"$f":"IF(C152=activestate,IF(D152='Heating Load'!C$2,1,0),0)","v":0},"NY","Massena",{"$f":"+E$6-(E$6*((0.1392+(-0.00846*$H152)+(-0.0001074*$H152^2)+(0.0228*E$6))))","v":5.15944},5.2730859999999993,5.7797559999999999,-10]
[147,{"$f":"IF(C153=activestate,IF(D153='Heating Load'!C$2,1,0),0)","v":0},"NY","New York City",7.2425267200000008,7.4271870399999997,8.28892864,16]
[148,{"$f":"IF(C154=activestate,IF(D154='Heating Load'!C$2,1,0),0)","v":0},"NY","Rochester",6.2052760000000013,6.3545754999999993,7.0395129999999995,5]
[149,{"$f":"IF(C155=activestate,IF(D155='Heating Load'!C$2,1,0),0)","v":0},"NY","Syracuse",5.9620844800000006,6.1030933599999999,6.7465777600000001,2]
[150,{"$f":"IF(C156=activestate,IF(D156='Heating Load'!C$2,1,0),0)","v":0},"OH","Akron",6.2052760000000013,6.3545754999999993,7.0395129999999995,5]
[151,{"$f":"IF(C157=activestate,IF(D157='Heating Load'!C$2,1,0),0)","v":0},"OH","Cleveland",6.2901203199999998,6.4423122399999997,7.1417118400000001,6]
[152,{"$f":"IF(C158=activestate,IF(D158='Heating Load'!C$2,1,0),0)","v":0},"OH","Columbus",6.4654796799999996,6.6236497599999993,7.3529401599999993,8]
[153,{"$f":"IF(C159=activestate,IF(D159='Heating Load'!C$2,1,0),0)","v":0},"OH","Dayton",6.3332513200000005,6.4869136150000006,7.1936650899999997,6.5]
[154,{"$f":"IF(C160=activestate,IF(D160='Heating Load'!C$2,1,0),0)","v":0},"OH","Mansfield",6.122321920000001,6.2687934399999996,6.9395910399999998,4]
[155,{"$f":"IF(C161=activestate,IF(D161='Heating Load'!C$2,1,0),0)","v":0},"OH","Toledo",6.0412580800000004,6.1849660599999998,6.8419459600000003,3]
[156,{"$f":"IF(C162=activestate,IF(D162='Heating Load'!C$2,1,0),0)","v":0},"OH","Youngstown",6.122321920000001,6.2687934399999996,6.9395910399999998,4]
[157,{"$f":"IF(C163=activestate,IF(D163='Heating Load'!C$2,1,0),0)","v":0},"OK","Oklahoma City",7.2425267200000008,7.4271870399999997,8.28892864,16]
[158,{"$f":"IF(C164=activestate,IF(D164='Heating Load'!C$2,1,0),0)","v":0},"OK","Tulsa",7.0369235200000002,7.2145746400000004,8.0412702399999993,14]
[159,{"$f":"IF(C165=activestate,IF(D165='Heating Load'!C$2,1,0),0)","v":0},"OR","Astoria",8.763245920000001,8.9997489399999999,10.12070404,29]
[160,{"$f":"IF(C166=activestate,IF(D166='Heating Load'!C$2,1,0),0)","v":0},"OR","Eugene",8.3839571199999998,8.6075298399999998,9.6638334399999994,26]
[161,{"$f":"IF(C167=activestate,IF(D167='Heating Load'!C$2,1,0),0)","v":0},"OR","Medford",8.1405491200000011,8.3558238399999993,9.3706374399999994,24]
[162,{"$f":"IF(C168=activestate,IF(D168='Heating Load'!C$2,1,0),0)","v":0},"OR","North Bend",9.1595468800000006,9.4095601599999998,10.598066559999999,32]
[163,{"$f":"IF(C169=activestate,IF(D169='Heating Load'!C$2,1,0),0)","v":0},"OR","Pendleton",6.7426955199999998,6.9103161399999999,7.6868592400000004,11]
[164,{"$f":"IF(C170=activestate,IF(D170='Heating Load'!C$2,1,0),0)","v":0},"OR","Portland",8.5084964800000016,8.7363148600000002,9.8138467600000006,27]
[165,{"$f":"IF(C171=activestate,IF(D171='Heating Load'!C$2,1,0),0)","v":0},"OR","Redmond",6.5559947200000002,6.7172505400000002,7.4619696399999995,9]
[166,{"$f":"IF(C172=activestate,IF(D172='Heating Load'!C$2,1,0),0)","v":0},"OR","Salem",8.2613080000000014,8.4806995000000001,9.5160970000000002,25]
[167,{"$f":"IF(C173=activestate,IF(D173='Heating Load'!C$2,1,0),0)","v":0},"PA","Allentown",6.6484000000000005,6.8128060000000001,7.5732759999999999,10]
[168,{"$f":"IF(C174=activestate,IF(D174='Heating Load'!C$2,1,0),0)","v":0},"PA","Bradford",5.7359051200000009,5.8692033400000003,6.4741344400000003,-1]
[169,{"$f":"IF(C175=activestate,IF(D175='Heating Load'!C$2,1,0),0)","v":0},"PA","Erie",6.3768548800000007,6.53200366,7.2461875599999992,7]
[170,{"$f":"IF(C176=activestate,IF(D176='Heating Load'!C$2,1,0),0)","v":0},"PA","Harrisburg",6.9369572800000006,7.1112004600000001,7.9208563600000002,13]
[171,{"$f":"IF(C177=activestate,IF(D177='Heating Load'!C$2,1,0),0)","v":0},"PA","Philadelphia ",7.0703271923680004,7.2491170739259996,8.0815064817159996,14.33]
[172,{"$f":"IF(C178=activestate,IF(D178='Heating Load'!C$2,1,0),0)","v":0},"PA","Pittsburgh",6.5559947200000002,6.7172505400000002,7.4619696399999995,9]
[173,{"$f":"IF(C179=activestate,IF(D179='Heating Load'!C$2,1,0),0)","v":0},"PA","Wilkes-Barre ",6.3768548800000007,6.53200366,7.2461875599999992,7]
[174,{"$f":"IF(C180=activestate,IF(D180='Heating Load'!C$2,1,0),0)","v":0},"PA","Williamsport ",6.3768548800000007,6.53200366,7.2461875599999992,7]
[175,{"$f":"IF(C181=activestate,IF(D181='Heating Load'!C$2,1,0),0)","v":0},"RI","Providence",6.6484000000000005,6.8128060000000001,7.5732759999999999,10]
[176,{"$f":"IF(C182=activestate,IF(D182='Heating Load'!C$2,1,0),0)","v":0},"SC","Charleston",8.6349260800000014,8.8670545599999997,9.96613696,28]
[177,{"$f":"IF(C183=activestate,IF(D183='Heating Load'!C$2,1,0),0)","v":0},"SC","Columbia",8.1405491200000011,8.3558238399999993,9.3706374399999994,24]
[178,{"$f":"IF(C184=activestate,IF(D184='Heating Load'!C$2,1,0),0)","v":0},"SC","Greenville",8.0216804800000006,8.2329028599999994,9.2274547600000005,23]
[179,{"$f":"IF(C185=activestate,IF(D185='Heating Load'!C$2,1,0),0)","v":0},"SD","Huron",5.0521292800000008,5.1621169600000005,5.6504953599999999,-12]
[180,{"$f":"IF(C186=activestate,IF(D186='Heating Load'!C$2,1,0),0)","v":0},"SD","Pierre",5.2159307200000011,5.3315025400000007,5.8478016400000001,-9]
[181,{"$f":"IF(C187=activestate,IF(D187='Heating Load'!C$2,1,0),0)","v":0},"SD","Rapid City",5.4607960000000002,5.5847154999999997,6.1427529999999999,-5]
[182,{"$f":"IF(C188=activestate,IF(D188='Heating Load'!C$2,1,0),0)","v":0},"SD","Sioux Falls",5.1048395200000005,5.2166241399999995,5.7139872399999998,-11]
[183,{"$f":"IF(C189=activestate,IF(D189='Heating Load'!C$2,1,0),0)","v":0},"TN","Bristol",7.0369235200000002,7.2145746400000004,8.0412702399999993,14]
[184,{"$f":"IF(C190=activestate,IF(D190='Heating Load'!C$2,1,0),0)","v":0},"TN","Chattanooga",7.6764160000000006,7.8758679999999996,8.8115679999999994,20]
[185,{"$f":"IF(C191=activestate,IF(D191='Heating Load'!C$2,1,0),0)","v":0},"TN","Knoxville",7.5651083200000011,7.7607657400000001,8.6774928399999993,19]
[186,{"$f":"IF(C192=activestate,IF(D192='Heating Load'!C$2,1,0),0)","v":0},"TN","Memphis",7.7896139200000007,7.99292494,8.9479200399999996,21]
[187,{"$f":"IF(C193=activestate,IF(D193='Heating Load'!C$2,1,0),0)","v":0},"TN","Nashville",7.2425267200000008,7.4271870399999997,8.28892864,16]
[188,{"$f":"IF(C194=activestate,IF(D194='Heating Load'!C$2,1,0),0)","v":0},"TX","Abilene",7.9047020800000007,8.1119365600000002,9.08654896,22]
[189,{"$f":"IF(C195=activestate,IF(D195='Heating Load'!C$2,1,0),0)","v":0},"TX","Amarillo",6.8388812800000007,7.0097809599999996,7.8027193600000002,12]
[190,{"$f":"IF(C196=activestate,IF(D196='Heating Load'!C$2,1,0),0)","v":0},"TX","Austin",8.8934560000000005,9.1343979999999991,10.277547999999999,30]
[191,{"$f":"IF(C197=activestate,IF(D197='Heating Load'!C$2,1,0),0)","v":0},"TX","Brownsville",10.299520000000001,10.588395999999999,11.971216,40]
[192,{"$f":"IF(C198=activestate,IF(D198='Heating Load'!C$2,1,0),0)","v":0},"TX","Corpus Christi",9.7144115200000005,9.9833406399999998,11.266426239999999,36]
[193,{"$f":"IF(C199=activestate,IF(D199='Heating Load'!C$2,1,0),0)","v":0},"TX","El Paso",8.2613080000000014,8.4806995000000001,9.5160970000000002,25]
[194,{"$f":"IF(C200=activestate,IF(D200='Heating Load'!C$2,1,0),0)","v":0},"TX","Fort Worth",8.1405491200000011,8.3558238399999993,9.3706374399999994,24]
[195,{"$f":"IF(C201=activestate,IF(D201='Heating Load'!C$2,1,0),0)","v":0},"TX","Houston",9.2272510000000008,9.4795723750000001,10.67961925,32.5]
[196,{"$f":"IF(C202=activestate,IF(D202='Heating Load'!C$2,1,0),0)","v":0},"TX","Lubbock",7.4016910000000005,7.5917773749999995,8.480649249999999,17.5]
[197,{"$f":"IF(C203=activestate,IF(D203='Heating Load'!C$2,1,0),0)","v":0},"TX","Lufkin",8.5084964800000016,8.7363148600000002,9.8138467600000006,27]
[198,{"$f":"IF(C204=activestate,IF(D204='Heating Load'!C$2,1,0),0)","v":0},"TX","Midland",7.9047020800000007,8.1119365600000002,9.08654896,22]
[199,{"$f":"IF(C205=activestate,IF(D205='Heating Load'!C$2,1,0),0)","v":0},"TX","San Angelo",8.1405491200000011,8.3558238399999993,9.3706374399999994,24]
[200,{"$f":"IF(C206=activestate,IF(D206='Heating Load'!C$2,1,0),0)","v":0},"TX","Victoria",9.2954276800000013,9.5500732599999996,10.76174116,33]
[201,{"$f":"IF(C207=activestate,IF(D207='Heating Load'!C$2,1,0),0)","v":0},"TX","Waco",8.3839571199999998,8.6075298399999998,9.6638334399999994,26]
[202,{"$f":"IF(C208=activestate,IF(D208='Heating Load'!C$2,1,0),0)","v":0},"TX","Wichita Falls",7.5651083200000011,7.7607657400000001,8.6774928399999993,19]
[203,{"$f":"IF(C209=activestate,IF(D209='Heating Load'!C$2,1,0),0)","v":1},"US",null,6.7278185050535928,6.8949319540895111,7.6689391992691007,10.843552631578946]
[204,{"$f":"IF(C210=activestate,IF(D210='Heating Load'!C$2,1,0),0)","v":0},"UT","Cedar City",6.4654796799999996,6.6236497599999993,7.3529401599999993,8]
[205,{"$f":"IF(C211=activestate,IF(D211='Heating Load'!C$2,1,0),0)","v":0},"UT","Salt Lake City",6.7426955199999998,6.9103161399999999,7.6868592400000004,11]
[206,{"$f":"IF(C212=activestate,IF(D212='Heating Load'!C$2,1,0),0)","v":0},"VA","Lynchburg",7.3481636800000008,7.5364252599999997,8.4161731599999996,17]
[207,{"$f":"IF(C213=activestate,IF(D213='Heating Load'!C$2,1,0),0)","v":0},"VA","Norfolk",8.1405491200000011,8.3558238399999993,9.3706374399999994,24]
[208,{"$f":"IF(C214=activestate,IF(D214='Heating Load'!C$2,1,0),0)","v":0},"VA","Richmond",7.4556908800000006,7.6476181600000004,8.5456945599999994,18]
[209,{"$f":"IF(C215=activestate,IF(D215='Heating Load'!C$2,1,0),0)","v":0},"VA","Roanoke",7.3481636800000008,7.5364252599999997,8.4161731599999996,17]
[210,{"$f":"IF(C216=activestate,IF(D216='Heating Load'!C$2,1,0),0)","v":0},"VA","Sterling",7.0369235200000002,7.2145746400000004,8.0412702399999993,14]
[211,{"$f":"IF(C217=activestate,IF(D217='Heating Load'!C$2,1,0),0)","v":0},"VT","Burlington",{"$f":"+E$6-(E$6*((0.1392+(-0.00846*$H217)+(-0.0001074*$H217^2)+(0.0228*E$6))))","v":5.3967443199999998},5.5184802400000006,6.06559984,-6]
[212,{"$f":"IF(C218=activestate,IF(D218='Heating Load'!C$2,1,0),0)","v":0},"WA","Olympia",8.0216804800000006,8.2329028599999994,9.2274547600000005,23]
[213,{"$f":"IF(C219=activestate,IF(D219='Heating Load'!C$2,1,0),0)","v":0},"WA","Quillayute",8.5084964800000016,8.7363148600000002,9.8138467600000006,27]
[214,{"$f":"IF(C220=activestate,IF(D220='Heating Load'!C$2,1,0),0)","v":0},"WA","Seattle",8.6349260800000014,8.8670545599999997,9.96613696,28]
[215,{"$f":"IF(C221=activestate,IF(D221='Heating Load'!C$2,1,0),0)","v":0},"WA","Spokane",6.3768548800000007,6.53200366,7.2461875599999992,7]
[216,{"$f":"IF(C222=activestate,IF(D222='Heating Load'!C$2,1,0),0)","v":0},"WA","Yakima",6.7426955199999998,6.9103161399999999,7.6868592400000004,11]
[217,{"$f":"IF(C223=activestate,IF(D223='Heating Load'!C$2,1,0),0)","v":0},"WI","Eau Claire",5.0013092800000001,5.1095644599999996,5.5892803599999992,-13]
[218,{"$f":"IF(C224=activestate,IF(D224='Heating Load'!C$2,1,0),0)","v":0},"WI","Green Bay",5.2743116800000003,5.3918737599999993,5.9181241599999996,-8]
[219,{"$f":"IF(C225=activestate,IF(D225='Heating Load'!C$2,1,0),0)","v":0},"WI","La Crosse",5.2743116800000003,5.3918737599999993,5.9181241599999996,-8]
[220,{"$f":"IF(C226=activestate,IF(D226='Heating Load'!C$2,1,0),0)","v":0},"WI","Madison",5.3967443199999998,5.5184802400000006,6.06559984,-6]
[221,{"$f":"IF(C227=activestate,IF(D227='Heating Load'!C$2,1,0),0)","v":0},"WI","Milwaukee",5.6642924800000003,5.7951493599999999,6.3878737599999997,-2]
[222,{"$f":"IF(C228=activestate,IF(D228='Heating Load'!C$2,1,0),0)","v":0},"WV","Charleston",6.7426955199999998,6.9103161399999999,7.6868592400000004,11]
[223,{"$f":"IF(C229=activestate,IF(D229='Heating Load'!C$2,1,0),0)","v":0},"WV","Elkins",6.2052760000000013,6.3545754999999993,7.0395129999999995,5]
[224,{"$f":"IF(C230=activestate,IF(D230='Heating Load'!C$2,1,0),0)","v":0},"WV","Huntington",6.7426955199999998,6.9103161399999999,7.6868592400000004,11]
[225,{"$f":"IF(C231=activestate,IF(D231='Heating Load'!C$2,1,0),0)","v":0},"WY","Casper",5.4607960000000002,5.5847154999999997,6.1427529999999999,-5]
[226,{"$f":"IF(C232=activestate,IF(D232='Heating Load'!C$2,1,0),0)","v":0},"WY","Cheyenne",5.8094080000000003,5.9452119999999997,6.5626720000000001,0]
[227,{"$f":"IF(C233=activestate,IF(D233='Heating Load'!C$2,1,0),0)","v":0},"WY","Lander",5.334582880000001,5.4541996600000004,5.9907235600000002,-7]
[228,{"$f":"IF(C234=activestate,IF(D234='Heating Load'!C$2,1,0),0)","v":0},"WY","Rock Springs ",5.6642924800000003,5.7951493599999999,6.3878737599999997,-2]
[229,{"$f":"IF(C235=activestate,IF(D235='Heating Load'!C$2,1,0),0)","v":0},"WY","Sheridan",5.2743116800000003,5.3918737599999993,5.9181241599999996,-8]
[230,{"$f":"IF(C236=activestate,IF(D236='Heating Load'!C$2,1,0),0)","v":0},"AB",null,5.334582880000001,5.4541996600000004,5.9907235600000002,-7,"Billings, MT"]
[231,{"$f":"IF(C237=activestate,IF(D237='Heating Load'!C$2,1,0),0)","v":0},"BC",null,8.6349260800000014,8.8670545599999997,9.96613696,28,"Seattle, WA"]
[232,{"$f":"IF(C238=activestate,IF(D238='Heating Load'!C$2,1,0),0)","v":0},"MB",null,5.2743116800000003,5.3918737599999993,5.9181241599999996,-8,"Green Bay, WI"]
[233,{"$f":"IF(C239=activestate,IF(D239='Heating Load'!C$2,1,0),0)","v":0},"NB",null,{"$f":"+E$6-(E$6*((0.1392+(-0.00846*$H239)+(-0.0001074*$H239^2)+(0.0228*E$6))))","v":5.9620844800000006},6.1030933599999999,6.7465777600000001,2,"Portland, ME"]
[234,{"$f":"IF(C240=activestate,IF(D240='Heating Load'!C$2,1,0),0)","v":0},"NF",null,5.15944,5.2730859999999993,5.7797559999999999,-10,"Anchorage, AK"]
[235,{"$f":"IF(C241=activestate,IF(D241='Heating Load'!C$2,1,0),0)","v":0},"NS",null,{"$f":"+E$6-(E$6*((0.1392+(-0.00846*$H241)+(-0.0001074*$H241^2)+(0.0228*E$6))))","v":5.9620844800000006},6.1030933599999999,6.7465777600000001,2,"Portland, ME"]
[236,{"$f":"IF(C242=activestate,IF(D242='Heating Load'!C$2,1,0),0)","v":0},"ON",null,5.9620844800000006,6.1030933599999999,6.7465777600000001,2,"Lansing, MI"]
[237,{"$f":"IF(C243=activestate,IF(D243='Heating Load'!C$2,1,0),0)","v":0},"PE",null,{"$f":"+E$6-(E$6*((0.1392+(-0.00846*$H243)+(-0.0001074*$H243^2)+(0.0228*E$6))))","v":5.9620844800000006},6.1030933599999999,6.7465777600000001,2,"Portland, ME"]
[238,{"$f":"IF(C244=activestate,IF(D244='Heating Load'!C$2,1,0),0)","v":0},"QB",null,5.9620844800000006,6.1030933599999999,6.7465777600000001,2,"Portland, ME"]
[239,{"$f":"IF(C245=activestate,IF(D245='Heating Load'!C$2,1,0),0)","v":0},"SK",null,4.8169316799999997,4.9189012599999993,5.3671891599999997,-17,"Fargo, ND"]
[240,{"$f":"IF(C246=activestate,IF(D246='Heating Load'!C$2,1,0),0)","v":0},"Canada Avg.",null,5.9,6.2,6.4,-0.4]

{"sheet":"AppTech","index":4,"n_rows":53,"n_cols":8,"rows_kept":53,"cut":false,"hidden":false,"merged":[]}
["Appliance Technologies"]
[]
["Furnace","Selected"]
[null,"Technology"]
[null,{"$f":"furntype","v":1},1,2,3,4,5]
[null,{"$f":"LOOKUP(B$5,C$5:R$5,C6:R6)","v":"Average Furnace"},"Average Furnace","High Efficiency Furnace","Condensing Furnace","Standard Boiler","Condensing Boiler"]
["Capacity (RT)",{"$f":"LOOKUP(B$5,C$5:R$5,C7:R7)","v":0}]
["CapLow (RT)",{"$f":"LOOKUP(B$5,C$5:R$5,C8:R8)","v":38000},38000,38000,38000,38000,38000]
["CapHigh (RT)",{"$f":"LOOKUP(B$5,C$5:R$5,C9:R9)","v":128000},128000,128000,128000,128000,128000]
[]
["Fuel","Natural Gas","Natural Gas","Natural Gas","Natural Gas","Natural Gas","Natural Gas"]
[]
["AFUE",{"$f":"LOOKUP(B$5,C$5:R$5,C13:R13)","v":0.8},0.8,0.92,0.96599999999999997,0.85,0.92]
["NOx lb/MMBtu",{"$f":"LOOKUP(B$5,C$5:R$5,C14:R14)","v":9.1999999999999998E-2},9.1999999999999998E-2,9.1999999999999998E-2,9.1999999999999998E-2,9.1999999999999998E-2,9.1999999999999998E-2]
["SO2 lb/MMBtu",{"$f":"LOOKUP(B$5,C$5:R$5,C15:R15)","v":5.8399999999999999E-4},5.8399999999999999E-4,5.8399999999999999E-4,5.8399999999999999E-4,5.8399999999999999E-4,5.8399999999999999E-4]
["CO2 lb/MMBtu",{"$f":"LOOKUP(B$5,C$5:R$5,C16:R16)","v":117},117,117,117,117,117]
[]
[]
[]
["Natural Gas Cooktop Range"]
["Efficiency",0.4]
[]
[]
["Electric Cooktop Range",null,null,null,null,null,null,"*not being used"]
["Efficiency",0.74]
[]
[]
[]
[]
[]
[]
["Number in Household","Hot Water Demand - Gal/day","Hot Water Demand - Btu/day","Hot Water Demand - MMBtu/year"]
[0,0,0,0]
[1,35,{"$f":"B34*77*8.3","v":22368.500000000004},{"$f":"C34*365/1000000","v":8.1645025000000011}]
[2,47.5,30357.250000000004,11.080396250000002]
[3,60,38346,13.99629]
[4,70,44737.000000000007,16.329005000000002]
[5,80,51128.000000000007,18.661720000000003]
[6,90,57519.000000000007,20.994435000000003]
[7,100,63910.000000000007,23.327150000000003]
[8,110,70301,25.659865]
[9,120,76692,27.99258]
[10,130,83083,30.325295000000001]
[11,140,89474.000000000015,32.658010000000004]
[12,150,95865.000000000015,34.990725000000005]
[13,160,102256.00000000001,37.323440000000005]
[14,170,108647.00000000001,39.656155000000005]
[15,180,115038.00000000001,41.988870000000006]
[16,190,121429.00000000001,44.321585000000006]
[17,200,127820.00000000001,46.654300000000006]
[18,210,134211,48.987015]
[19,220,140602,51.31973]
[20,230,146993,53.652445]

{"sheet":"Factors","index":5,"n_rows":29,"n_cols":8,"rows_kept":29,"cut":false,"hidden":false,"merged":[[16,0,16,1]]}
["Factors"]
[]
["General Emission Factors"]
[{"$f":"12/44","v":0.27272727272727271},null,"ratio of carbon to CO2"]
[{"$f":"2000/2206","v":0.90661831368993651},null,"ratio of tonnes to tons"]
[4.5999999999999996,null,"metric tons of Carbon per car",null,null,null,{"$f":"A6/11500","v":3.9999999999999996E-4},"metric tons CO2e/mile"]
[1,null,"metric tons of Carbon per acre of forest"]
[2000,null,"pounds per ton"]
[2.8299999999999999E-2,null,"ratio of cubic feet to cubic meters"]
[]
["Natural Gas"]
[0.42380000000000001,null,"lb/cf heat content of natural gas"]
[1020,null,"Btu/cf of natural gas"]
[7.0967437470559683E-7,null,"sulfur content of natural gas"]
[117,null,"lb/MMBtu CO2 emission factor"]
[]
["Oil"]
[]
[]
[]
[]
[]
["Clothes Dryers"]
[7,null,"lbs per load",null,"(DOE test procedure)"]
[416,null,"loads per year",null,"(DOE test procedure)"]
[]
[]
["Electricity Generation"]
[7.0000000000000007E-2,null,"transmission losses"]

{"sheet":"Residential Prices","index":6,"n_rows":67,"n_cols":10,"rows_kept":67,"cut":false,"hidden":false,"merged":[]}
[]
[null,"Residential Electricity, Gas, Oil, and Propane Prices"]
[]
[null,"Lookup","State or Province","Abbrev","Residential Electricity Prices: Cents per Kilowatthour","Residential Natural Gas Price ($/MMBtu)","Oil $/gal"," Propane $/gal",null,"Source (US Data):"]
[null,{"$f":"VLOOKUP(C5,Lists!$B$21:$F$83,5,0)","v":3},"Alabama","AL",14.63,19.36,4.28,3.24,null,"Average Retail Price of Electricity (2023 data)"]
[null,{"$f":"VLOOKUP(C6,Lists!$B$21:$F$83,5,0)","v":2},"Alaska","AK",23.9,10.97,4.28,2.56,null,"Retail Sales of Electricity to Ultimate Customers: Annual Data by Sector, by State, by Provider"]
[null,{"$f":"VLOOKUP(C7,Lists!$B$21:$F$83,5,0)","v":54},"Alberta","AB",19.091999999999999,9.14,4.16,3.5,null,"https://www.eia.gov/electricity/data.php"]
[null,{"$f":"VLOOKUP(C8,Lists!$B$21:$F$83,5,0)","v":5},"Arizona","AZ",14.02,18.73,4.28,2.56]
[null,{"$f":"VLOOKUP(C9,Lists!$B$21:$F$83,5,0)","v":4},"Arkansas","AR",12.25,17.21,4.28,2.38,null,"Residential Natural Gas Prices (2023 data)"]
[null,{"$f":"VLOOKUP(C10,Lists!$B$21:$F$83,5,0)","v":55},"British Columbia","BC",8.4359999999999999,9.14,4.16,3.5,null,"https://www.eia.gov/dnav/ng/ng_pri_sum_a_EPG0_PRS_DMcf_a.htm"]
[null,{"$f":"VLOOKUP(C11,Lists!$B$21:$F$83,5,0)","v":6},"California","CF",29.51,21.05,4.28,2.56]
[null,{"$f":"VLOOKUP(C12,Lists!$B$21:$F$83,5,0)","v":53},"Canadian Average","CA",11.47,9.14,4.16,3.5,null,"Residential Propane Prices (2023 data, applied US Average to states with no data)"]
[null,{"$f":"VLOOKUP(C13,Lists!$B$21:$F$83,5,0)","v":7},"Colorado","CL",14.3,11.45,4.28,2.34,null,"https://www.eia.gov/dnav/pet/pet_pri_wfr_a_EPLLPA_PRS_dpgal_w.htm"]
[null,{"$f":"VLOOKUP(C14,Lists!$B$21:$F$83,5,0)","v":8},"Connecticut","CT",29.88,18.190000000000001,4.16,3.7]
[null,{"$f":"VLOOKUP(C15,Lists!$B$21:$F$83,5,0)","v":10},"Delaware","DL",15.73,17.04,4.67,3.47,null,"Residential Heating Oil Prices (2023 data, applied US Average to states with no data)"]
[null,{"$f":"VLOOKUP(C16,Lists!$B$21:$F$83,5,0)","v":9},"District of Columbia","DC",16.45,16.18,4.28,2.56,null,"https://www.eia.gov/dnav/pet/pet_pri_wfr_a_EPD2F_prs_dpgal_w.htm"]
[null,{"$f":"VLOOKUP(C17,Lists!$B$21:$F$83,5,0)","v":11},"Florida","FL",15.21,24.25,4.28,4.72]
[null,{"$f":"VLOOKUP(C18,Lists!$B$21:$F$83,5,0)","v":12},"Georgia","GA",13.69,18.329999999999998,4.28,2.98,null,"Source (Canadian Data)"]
[null,{"$f":"VLOOKUP(C19,Lists!$B$21:$F$83,5,0)","v":13},"Hawaii","HA",42.39,51.16,4.28,2.56,null,"Residential Electricity Price (2023)"]
[null,{"$f":"VLOOKUP(C20,Lists!$B$21:$F$83,5,0)","v":15},"Idaho","ID",11.05,9.39,4.28,2.54,null,"Assumes 1000 kWh/yr consumption; 0.74:1 CAD/USD"]
[null,{"$f":"VLOOKUP(C21,Lists!$B$21:$F$83,5,0)","v":16},"Illinois","IL",15.71,11.15,4.28,1.96,null,"https://www.energyhub.org/electricity-prices/"]
[null,{"$f":"VLOOKUP(C22,Lists!$B$21:$F$83,5,0)","v":17},"Indiana","IN",14.94,11.21,3.9,2.44]
[null,{"$f":"VLOOKUP(C23,Lists!$B$21:$F$83,5,0)","v":14},"Iowa","IA",13.31,11.34,3.56,1.75,null,"Natural Resources Canada"]
[null,{"$f":"VLOOKUP(C24,Lists!$B$21:$F$83,5,0)","v":18},"Kansas","KA",13.38,14.02,4.28,1.91,null,"Energy Prices by Energy Source - Natural Gas (2022)"]
[null,{"$f":"VLOOKUP(C25,Lists!$B$21:$F$83,5,0)","v":19},"Kentucky","KY",12.65,14.93,3.87,2.5299999999999998,null,"Used 0.72 CAD/USD"]
[null,{"$f":"VLOOKUP(C26,Lists!$B$21:$F$83,5,0)","v":20},"Louisiana","LA",11.55,15.63,4.28,2.56,null,"https://oee.nrcan.gc.ca/corporate/statistics/neud/dpa/showTable.cfm?type=HB&sector=res&juris=00&rn=18&page=0#sources"]
[null,{"$f":"VLOOKUP(C27,Lists!$B$21:$F$83,5,0)","v":23},"Maine","ME",27.42,18.399999999999999,4.05,3.16]
[null,{"$f":"VLOOKUP(C28,Lists!$B$21:$F$83,5,0)","v":56},"Manitoba","MB",7.5479999999999992,9.14,4.16,3.5]
[null,{"$f":"VLOOKUP(C29,Lists!$B$21:$F$83,5,0)","v":22},"Maryland","MD",16.600000000000001,16.71,4.46,3.39,null,"Weekly Average Retail Prices for Furnace Oil in 2024"]
[null,{"$f":"VLOOKUP(C30,Lists!$B$21:$F$83,5,0)","v":21},"Massachusetts","MS",29.61,20.66,4.29,3.47,null,"https://www2.nrcan.gc.ca/eneene/sources/pripri/prices_bycity_e.cfm?productID=7&locationID=66&locationID=8&locationID=29&frequency=W&priceYear=2024&Redisplay="]
[null,{"$f":"VLOOKUP(C31,Lists!$B$21:$F$83,5,0)","v":24},"Michigan","MC",18.84,11.06,3.71,2.2999999999999998,null,"Used 0.72 CAD/USD"]
[null,{"$f":"VLOOKUP(C32,Lists!$B$21:$F$83,5,0)","v":25},"Minnesota","MN",14.73,11.51,4.09,2]
[null,{"$f":"VLOOKUP(C33,Lists!$B$21:$F$83,5,0)","v":27},"Mississippi","MI",13.23,15.07,4.28,2.94,null,"Weekly Average Retail Prices for Auto Propane in 2024"]
[null,{"$f":"VLOOKUP(C34,Lists!$B$21:$F$83,5,0)","v":26},"Missouri","MO",12.58,16.54,4.28,2.14,null,"https://www2.nrcan-rncan.gc.ca/eneene/sources/pripri/prices_bycity_e.cfm?productID=6&locationID=66&frequency=M&priceYear=2024&Redisplay="]
[null,{"$f":"VLOOKUP(C35,Lists!$B$21:$F$83,5,0)","v":28},"Montana","MT",12.54,9.8000000000000007,4.28,2.21,null,"Used 0.72 CAD/USD"]
[null,{"$f":"VLOOKUP(C36,Lists!$B$21:$F$83,5,0)","v":31},"Nebraska","NB",11.2,12.62,3.47,1.72]
[null,{"$f":"VLOOKUP(C37,Lists!$B$21:$F$83,5,0)","v":35},"Nevada","NV",16.670000000000002,16.350000000000001,4.28,2.56]
[null,{"$f":"VLOOKUP(C38,Lists!$B$21:$F$83,5,0)","v":57},"New Brunswick","NB",10.286,9.14,4.16,3.5]
[null,{"$f":"VLOOKUP(C39,Lists!$B$21:$F$83,5,0)","v":32},"New Hampshire","NH",28.15,20.25,4.34,3.54]
[null,{"$f":"VLOOKUP(C40,Lists!$B$21:$F$83,5,0)","v":33},"New Jersey","NJ",17.7,12.73,4.54,3.26]
[null,{"$f":"VLOOKUP(C41,Lists!$B$21:$F$83,5,0)","v":34},"New Mexico","NM",13.85,11.23,4.28,2.56]
[null,{"$f":"VLOOKUP(C42,Lists!$B$21:$F$83,5,0)","v":36},"New York","NY",22.25,16.28,4.53,3.3]
[null,{"$f":"VLOOKUP(C43,Lists!$B$21:$F$83,5,0)","v":58},"Newfoundland","NL",10.952,9.14,4.16,3.5]
[null,{"$f":"VLOOKUP(C44,Lists!$B$21:$F$83,5,0)","v":29},"North Carolina","NC",12.93,16.7,4.07,3.27]
[null,{"$f":"VLOOKUP(C45,Lists!$B$21:$F$83,5,0)","v":30},"North Dakota","ND",11.01,9.4,4.28,1.77]
[null,{"$f":"VLOOKUP(C46,Lists!$B$21:$F$83,5,0)","v":59},"Nova Scotia","NS",13.542,9.14,4.16,3.5]
[null,{"$f":"VLOOKUP(C47,Lists!$B$21:$F$83,5,0)","v":37},"Ohio","OH",15.38,13.17,4.0199999999999996,2.58]
[null,{"$f":"VLOOKUP(C48,Lists!$B$21:$F$83,5,0)","v":38},"Oklahoma","OK",12.08,14.47,4.28,2.38]
[null,{"$f":"VLOOKUP(C49,Lists!$B$21:$F$83,5,0)","v":60},"Ontario","ON",10.433999999999999,9.14,4.16,3.5]
[null,{"$f":"VLOOKUP(C50,Lists!$B$21:$F$83,5,0)","v":39},"Oregon","OR",12.73,15.19,4.28,2.56]
[null,{"$f":"VLOOKUP(C51,Lists!$B$21:$F$83,5,0)","v":40},"Pennsylvania","PA",18.100000000000001,14.87,4.07,2.85]
[null,{"$f":"VLOOKUP(C52,Lists!$B$21:$F$83,5,0)","v":61},"Prince Edward Island","PEI",13.616,9.14,4.16,3.5]
[null,{"$f":"VLOOKUP(C53,Lists!$B$21:$F$83,5,0)","v":62},"Quebec","QC",5.7720000000000002,9.14,4.16,3.5]
[null,{"$f":"VLOOKUP(C54,Lists!$B$21:$F$83,5,0)","v":41},"Rhode Island","RI",27.02,19.77,4.2699999999999996,3.53]
[null,{"$f":"VLOOKUP(C55,Lists!$B$21:$F$83,5,0)","v":63},"Saskatchewan","SK",14.725999999999999,9.14,4.16,3.5]
[null,{"$f":"VLOOKUP(C56,Lists!$B$21:$F$83,5,0)","v":42},"South Carolina","SC",13.68,16.82,4.28,2.56]
[null,{"$f":"VLOOKUP(C57,Lists!$B$21:$F$83,5,0)","v":43},"South Dakota","SD",12.32,10.029999999999999,4.28,1.92]
[null,{"$f":"VLOOKUP(C58,Lists!$B$21:$F$83,5,0)","v":44},"Tennessee","TN",12.19,11.25,4.28,3.16]
[null,{"$f":"VLOOKUP(C59,Lists!$B$21:$F$83,5,0)","v":45},"Texas","TX",14.46,16.72,4.28,2.88]
[null,{"$f":"Lists!A21","v":1},"United States","US",16,14.83,4.28,2.56]
[null,{"$f":"VLOOKUP(C61,Lists!$B$21:$F$83,5,0)","v":46},"Utah","UT",11.2,12.96,4.28,2.4300000000000002]
[null,{"$f":"VLOOKUP(C62,Lists!$B$21:$F$83,5,0)","v":48},"Vermont","VT",20.82,16.510000000000002,4.25,3.4]
[null,{"$f":"VLOOKUP(C63,Lists!$B$21:$F$83,5,0)","v":47},"Virginia","VA",14.26,16.579999999999998,4.2699999999999996,3.32]
[null,{"$f":"VLOOKUP(C64,Lists!$B$21:$F$83,5,0)","v":49},"Washington","WN",10.98,14.98,4.28,2.56]
[null,{"$f":"VLOOKUP(C65,Lists!$B$21:$F$83,5,0)","v":51},"West Virginia","WV",14.05,15.05,4.28,2.56]
[null,{"$f":"VLOOKUP(C66,Lists!$B$21:$F$83,5,0)","v":50},"Wisconsin","WS",16.88,10.5,3.6,1.97]
[null,{"$f":"VLOOKUP(C67,Lists!$B$21:$F$83,5,0)","v":52},"Wyoming","WY",11.46,13.22,4.28,2.56]

{"sheet":"Calc","index":7,"n_rows":154,"n_cols":11,"rows_kept":154,"cut":false,"hidden":false,"merged":[]}
[]
[]
[null,null,null,"Heat Type",{"$f":"heattype","v":1}]
["Space Heating",null,null,"Water Heat Type",{"$f":"wheattype","v":1}]
[]
["House Square Footage",{"$f":"sqft","v":2000}]
["NG Heating System Type",{"$f":"furntype","v":1},{"$f":"LOOKUP(B7,Lists!A4:A10,Lists!B4:B10)","v":"Average Furnace (AFUE 80%)"},null,null,"Current System"]
["NG Heating AFUE",{"$f":"_xlfn.XLOOKUP(furntype,Lists!A4:A10,Lists!C4:C10)","v":0.8},null,null,null,"Oil Heating System Type",{"$f":"_xlfn.IFS(E3=2,'User Input'!F24,E3=1,\"\",E3=3,\"\",E3=4,\"\")","v":""},{"$f":"IFERROR(_xlfn.XLOOKUP(G8,Lists!G87:G91,Oil),\"\")","v":""},"Gas Heating System Type",{"$f":"_xlfn.IFS(E3=4,'User Input'!F24,E3=1,\"\",E3=2,\"\",E3=3,\"\")","v":""},{"$f":"IFERROR(_xlfn.XLOOKUP(J8,Lists!A4:A10,Lists!B4:B10),\"\")","v":""}]
["Heating Load (MMBtu)",{"$f":"IF(sqft=0,0,heatload)","v":49.638628087719269},"MMBtu/yr",null,null,"AFUE",{"$f":"IFERROR(_xlfn.XLOOKUP(G8,Lists!G87:G91,Lists!I87:I91),\"\")","v":""},null,"AFUE",{"$f":"IFERROR(_xlfn.XLOOKUP(J8,Lists!A4:A10,Lists!C4:C10),\"\")","v":""}]
["NG Consumption (MMBtu)",{"$f":"B9/B8","v":62.048285109649086},"MMBtu/yr",null,null,"Oil Consumption (MMBtu)",{"$f":"IFERROR(B9/G9,\"\")","v":""},"MMBtu/yr","Gas Consumption",{"$f":"IFERROR(B9/J9,0)","v":0},"MMBtu/yr"]
["CO2 Emissions",{"$f":"B10*'Carbon Calculator'!E105","v":7299.7982481940098},"lbs/yr",null,null,"Oil Consumption (gal)",{"$f":"IFERROR(G10/0.137381,0)","v":0},"gal/yr","CO2 Emissions",{"$f":"J10*'Carbon Calculator'!E105","v":0},"lbs/yr"]
[null,null,null,null,null,"CO2 Emissions",{"$f":"G11*'Carbon Calculator'!E111/1000","v":0},"lbs/yr"]
["Electric Heating System Type",{"$f":"_xlfn.IFS(E3=1,'User Input'!F24,E3=2,\"\",E3=3,\"\",E3=4,\"\")","v":2},{"$f":"IFERROR(LOOKUP(B13,Lists!A87:A90,Lists!B87:B89),\"\")","v":"Standard Effic. Heat Pump - 7.5 HSPF2"}]
["Adjusted HSPF",{"$f":"IF(B13=2,'Adjusted HSPF'!E2,IF(B13=3,'Adjusted HSPF'!F2,IF(B13=4,'Adjusted HSPF'!G2,0)))","v":6.7278185050535928},null,null,null,"Propane Heating System Type",{"$f":"_xlfn.IFS(E3=3,'User Input'!F24,E3=1,\"\",E3=2,\"\",E3=4,\"\")","v":""},{"$f":"IF(E3=3,_xlfn.XLOOKUP(G14,Lists!K87:K93,Lists!L87:L93),\"\")","v":""}]
["Electric Resistance AFUE",{"$f":"IF(B13=1,0.99,0)","v":0},null,null,null,"AFUE",{"$f":"IF(E3=3,_xlfn.XLOOKUP(G14,Lists!K87:K93,Lists!M87:M93),\"\")","v":""}]
[null,null,null,null,null,"Propane Consumption (MMBtu)",{"$f":"IFERROR(B9/G15,\"\")","v":""},"MMBtu/yr"]
["Displaced Electricity (house)",{"$f":"IFERROR(IF(B13=1,B9/3412*1000/B15,B9/B14),0)","v":7.3781164058503172},"MWh/yr",null,null,"Propane Consumption (gal)",{"$f":"IFERROR(G16/0.0916,0)","v":0},"gal/yr"]
["Displaced Electric Generation",{"$f":"B17/(1-'Carbon Calculator'!E80)","v":7.7910416112463752},"MWh/yr",null,null,"CO2 Emissions",{"$f":"G17*'Carbon Calculator'!E108/1000","v":0},"lbs/yr"]
["Generation Fuel Consumption",{"$f":"B18*'Carbon Calculator'!E101/1000","v":67.51316002497704},"MMBtu/yr"]
["CO2 Emissions",{"$f":"B18*'Carbon Calculator'!E102","v":9896.64072606021},"lbs/yr"]
[]
[]
["Water Heating"]
[]
["Family Size",{"$f":"famsize","v":3},null,null,null,"Oil Water Heat Type",{"$f":"_xlfn.IFS(E4=2,'User Input'!F37,E4=1,\"\",E4=3,\"\",E4=4,\"\")","v":""},{"$f":"IFERROR(_xlfn.XLOOKUP(G25,Lists!G96,Lists!H96),\"\")","v":""},"Gas Water Heat Type",{"$f":"_xlfn.IFS(E4=4,'User Input'!F37,E4=1,\"\",E4=3,\"\",E4=2,\"\")","v":""},{"$f":"IFERROR(_xlfn.XLOOKUP(J25,Lists!A94:A101,Lists!B94:B101),\"\")","v":""}]
["NG Water Heat Type",{"$f":"gasWHtype","v":1},{"$f":"LOOKUP(B26,Lists!A94:A101,Lists!B94:B101)","v":"Standard Tank: UEF = .58"},null,null,"Oil Energy Factor (UEF)",{"$f":"IFERROR(_xlfn.XLOOKUP(G25,Lists!G96:G97,Lists!I96:I97),\"\")","v":""},null,"Gas Updated Energy Factor (UEF)",{"$f":"IFERROR(_xlfn.XLOOKUP(J25,Lists!A94:A101,Lists!C94:C101),\"\")","v":""}]
["NG Updated Energy Factor (UEF)",{"$f":"LOOKUP(gasWHtype,Lists!A94:A101,Lists!C94:C101)","v":0.57999999999999996}]
["Regional load factor",{"$f":"LOOKUP(state,Lists!A21:A83,Lists!E21:E83)","v":1},null,null,null,"Oil Consumption (MMBtu)",{"$f":"IFERROR((B30/G26*B28),\"\")","v":""},"MMBtu/yr","NG Consumption (MMBtu) ",{"$f":"IFERROR(IF(B25=0,0,IF(B27=0,0,(B30/J26*B28))),0)","v":0},"MMBtu/yr"]
[null,null,null,null,null,"Oil Consumption (gal)",{"$f":"IFERROR(G28/0.137381,0)","v":0},"gal/yr","CO2 Emissions",{"$f":"J28*'Carbon Calculator'!E105","v":0},"lbs/yr"]
["Water Heating Load (MMBtu) ",{"$f":"LOOKUP(famsize,AppTech!A33:A53,AppTech!D33:D53)","v":13.99629},"MMBtu/yr",null,null,"CO2 Emissions",{"$f":"G29*'Carbon Calculator'!E111/1000","v":0},"lbs/yr"]
["NG Consumption (MMBtu) ",{"$f":"IF(B25=0,0,IF(B27=0,0,(B30/B27*B28)))","v":24.131534482758621},"MMBtu/yr"]
["CO2 Emissions",{"$f":"B31*'Carbon Calculator'!E105","v":2839.0040567951319},"lbs/yr"]
[]
["Elec Water Heat Type",{"$f":"_xlfn.IFS(E4=1,'User Input'!F37,E4=2,\"\",E4=3,\"\",E4=4,\"\")","v":1},{"$f":"IFERROR(LOOKUP(B34,Lists!A104:A107,Lists!B104:B107),\"\")","v":"Standard: UEF = 0.92"},null,null,"Propane Water Heat Type",{"$f":"_xlfn.IFS(E4=3,'User Input'!F37,E4=1,\"\",E4=2,\"\",E4=4,\"\")","v":""},{"$f":"IFERROR(_xlfn.XLOOKUP(G34,Lists!K96:K103,Lists!L96:L103),\"\")","v":""}]
["Updated Elec Energy Factor (UEF)",{"$f":"IFERROR(LOOKUP(B34,Lists!A104:A107,Lists!C104:C107),\"\")","v":0.92},null,null,null,"Propane Updated Energy Factor (UEF)",{"$f":"IFERROR(_xlfn.XLOOKUP(G34,Lists!K96:K103,Lists!M96:M103),\"\")","v":""}]
["Displaced Electricity (house)",{"$f":"IFERROR(B30*B28/B35/3412*1000,0)","v":4.4587803914572604},"MWh/yr"]
["Displaced Electric Generation",{"$f":"B36/(1-'Carbon Calculator'!E80)","v":4.7083214270932006},"MWh/yr",null,null,"Propane Consumption (MMBtu)",{"$f":"IFERROR(B30/G35*B28,\"\")","v":""},"MMBtu/yr"]
["Generation Fuel Consumption",{"$f":"B37*'Carbon Calculator'!E101/1000","v":40.799892211783423},"MMBtu/yr",null,null,"Propane Consumption (gal)",{"$f":"IFERROR(G37/0.0916,0)","v":0},"gal/yr"]
["CO2 Emissions",{"$f":"B37*'Carbon Calculator'!E102","v":5980.7876676579817},"lbs/yr",null,null,"CO2 Emissions",{"$f":"G38*'Carbon Calculator'!E108/1000","v":0},"lbs/yr"]
[]
["Clothes Drying"]
[]
["Dryer Loads per week",{"$f":"dryerloads","v":7},null,null,null,"Propane Consumption",{"$f":"IF(dtype=2,B48/0.0916,0)","v":0},"gal/yr"]
["Dryer Loads per year",{"$f":"B43*52","v":364},null,null,null,"CO2 Emissions",{"$f":"G43*'Carbon Calculator'!E108/1000","v":0},"lbs/yr"]
["NG Standard Dryer (EF)",2.67]
["Gas Consumed per unit (MMBtu/yr) Standard",{"$f":"(Factors!A24/Calc!B45*Factors!A25)*3412/1000000","v":3.7212524344569289},"MMBtu/yr (based on 416 loads/year)"]
["Gas Consumed per load (MMBtu/yr)",{"$f":"B46/416","v":8.9453183520599253E-3},null,null,null,"Current NG Consumption",{"$f":"IF(dtype=3,B48,0)","v":0},"MMBTU/yr"]
["Total Gas Consumed per unit (MMBtu/yr)",{"$f":"B44*B47","v":3.2560958801498128}]
["CO2 Emissions",{"$f":"B48*'Carbon Calculator'!E105","v":383.07010354703675},"lbs/yr"]
[]
[]
["Elec Standard Dryer (EF)",3.73]
["Displaced Electricity (house)",{"$f":"IF(dtype=1,Factors!A24/Calc!B52*B44/1000,0)","v":0.68310991957104561},"MWh/yr"]
["Displaced Electric Generation",{"$f":"B53/(1-'Carbon Calculator'!E80)","v":0.72134099215527525},"MWh/yr"]
["Generation Fuel Consumption",{"$f":"B54*'Carbon Calculator'!E101/1000","v":6.2507700851778676},"MMBtu/yr"]
["CO2 Emissions",{"$f":"B54*'Carbon Calculator'!E102","v":916.28988735416783},"lbs/yr"]
[]
["Cooking"]
[]
["Gas Consumed (MMBtu/yr)",1.5,"MMBtu/yr",null,null,"Propane Consumption",{"$f":"IF(ctype=2,B60/0.0916,0)","v":0},"gal/yr"]
["NG Range Efficiency",{"$f":"cookeff","v":0.4},null,null,null,"CO2 Emissions",{"$f":"G60*'Carbon Calculator'!E108/1000","v":0},"lbs/yr"]
[]
["Cooking Energy",0.26100000000000001,"MWh/yr"]
[]
["Electric efficiency",{"$f":"cookelecuse","v":0.74}]
["Elec cooking load (MMBtu/yr)",null,"MMBtu/yr",null,null,"Current Gas Consumption",{"$f":"IF(ctype=3,B60,0)","v":0},"MMBtu/yr"]
["Displaced Electricity (house)",{"$f":"IF(ctype=1,B63/B65,0)","v":0.35270270270270271},"MWh/yr",null,null,"NG CO2 Emissions",{"$f":"IF(ctype=3,B60*'Carbon Calculator'!E105,\"\")","v":""},"lbs/yr"]
["Displaced Electric Generation",{"$f":"B67/(1-'Carbon Calculator'!E80)","v":0.37244213590570507},"MWh/yr"]
["Generation Fuel Consumption",{"$f":"B68*'Carbon Calculator'!E101/1000","v":3.2273920197203996},"MMBtu/yr"]
["CO2 Emissions",{"$f":"B68*'Carbon Calculator'!E102","v":473.09797511344505},"lbs/yr"]
[]
[]
[]
["Total"]
[]
["NG Alternative Consumption",{"$f":"B10+B31+B48+B60","v":90.935915472557525},"MMBtu/yr","Oil Consumption",{"$f":"G11+G29","v":0},"(gal/yr)",null,"Propane Consumption",{"$f":"G17+G38+G43+G60","v":0},"(gal/yr)"]
["Total Displaced Electricity (at the house)",{"$f":"B17+B36+B53+B67","v":12.872709419581325},"MWh/yr"]
[]
[null,null,null,null,null,null,null,"Current Home Gas Consumption",{"$f":"J10+J28+G47+G66","v":0},"MMBtu/yr"]
["NG NOx input",null,"lb/MMBtu"]
["NG NOx",null,"lbs/year"]
["NG SO2 input",null,"lb/MMBtu"]
["NG SO2  ",null,"lbs/year"]
["NG CO2 input",null,"lb/MMBtu"]
["NG CO2  ",null,"lbs/year"]
[]
[]
["Elec NOx rate",null,"lb/MWh"]
["Elec SO2 rate",null,"lb/MWh"]
["Elec CO2 rate",null,"lb/MWh"]
[]
["Total Displaced Generation",null,"MWh/yr"]
["Elec NOx",null,"lbs/yr"]
["Elec SO2",null,"lbs/yr"]
["Elec CO2",null,"lbs/yr"]
[]
[]
["CO2 Displaced",null,"tons/yr"]
["Carbon Displaced (metric tons)",null,"metric tons"]
[]
["Cars taken off the road",{"$f":"'Carbon Calculator'!I137","v":0.647704331596615}]
["Acres of forest",{"$f":"((('User Input'!L89/2000/1.1023)/Factors!A7))","v":2.9794399253444288}]
[]
["Miles driven per year",{"$f":"((('User Input'!L89/2000/1.1023)/Factors!G6))","v":7448.5998133610728}]
[]
[]
[]
["Used for graphs on User Input page","Natural Gas","Electric"]
["NOx",{"$f":"'User Input'!F85","v":9.6511337781443931},{"$f":"'User Input'!I85","v":11.223354273464889}]
["SOx",{"$f":"'User Input'!F87","v":7.7073138763491134},{"$f":"'User Input'!I87","v":5.3491714983857366E-2}]
[null,"Natural Gas","Electric"]
["CO2",{"$f":"'User Input'!F89","v":17266.816256185801},{"$f":"'User Input'!I89","v":10698.342996771473}]
[]
[]
["Look up Residential Prices"]
["Electricity Price",{"$f":"VLOOKUP(state,'Residential Prices'!$B$5:$F$67,4,0)","v":16},"cents/kWh"]
["Natural Gas Price",{"$f":"VLOOKUP(state,'Residential Prices'!$B$5:$F$67,5,0)","v":14.83},"dollars/MMBtu"]
["Oil Price",{"$f":"_xlfn.XLOOKUP(state,'Residential Prices'!B5:B67,'Residential Prices'!G5:G67)","v":4.28},"dollars/gal"]
["Propane Price",{"$f":"_xlfn.XLOOKUP(state,'Residential Prices'!B5:B67,'Residential Prices'!H5:H67)","v":2.56},"dollars/gal"]
["User Input Elec price",{"$f":"'User Input'!I15","v":17},"cents/kWh"]
["User Input NG price",{"$f":"'User Input'!F15","v":14.1},"dollars/MMBtu"]
["User Input Oil price",{"$f":"'User Input'!L15","v":4.0999999999999996},"dollars/gal"]
["User Input Propane price",{"$f":"'User Input'!N15","v":3},"dollars/gal"]
[]
["Elec price for calc",{"$f":"IF(AND(Erates=2,B120>=0),B120,B116)","v":16},"cents/kWh"]
["NG price for calc",{"$f":"IF(AND(NGrates=2,B121>=0),B121,B117)","v":14.83},"dollars/MMBtu"]
["Oil Price for calc",{"$f":"IF(AND(Orates=2,B122>=0),B122,B118)","v":4.28},"dollars/gal"]
["Propane Price for calc",{"$f":"IF(AND(Prates=2,B123>=0),B123,B119)","v":2.56},"dollars/gal"]
[]
["Energy Cost Calculations"]
["NG Alternative Calculation",{"$f":"B76*B126","v":1348.5796264580281},"$",null,null,null,"Cost"]
["Electricity Calculation",{"$f":"B77*B125*10","v":2059.6335071330118},"$",null,null,null,"Current Home","Gas Home"]
["Oil Calculation",{"$f":"E76*B127","v":0},"$","Gas","Electric","Space Heating",{"$f":"_xlfn.IFS(heattype=1,B17*$B$125*10,heattype=2,G11*B127,heattype=3,G17*B128,heattype=4,J10*B126)","v":1180.4986249360509},{"$f":"B10*B126","v":920.1760681760959}]
["Propane Calculation",{"$f":"I76*B128","v":0},"$","MMBTU/Yr","KWH","Water Heating",{"$f":"_xlfn.IFS(wheattype=1,B36*B125*10,wheattype=2,G29*B127,wheattype=3,G38*B128,wheattype=4,J28*B126)","v":713.40486263316166},{"$f":"B31*B126","v":357.87065637931033}]
["Current Gas Calculation",{"$f":"I79*B126","v":0},"$",{"$f":"+B10","v":62.048285109649086},{"$f":"+B17*1000","v":7378.1164058503173},"Clothes Drying",{"$f":"_xlfn.IFS(dtype=1,E137*$B$125/100,dtype=2,G43*B128,dtype=3,H135)","v":109.29758713136729},{"$f":"+D137*$B$126","v":48.287901902621726}]
[null,null,null,{"$f":"+B31","v":24.131534482758621},{"$f":"+B36*1000","v":4458.7803914572605},"Cooking",{"$f":"_xlfn.IFS(ctype=1,B67*B125*10,ctype=2,G60*B128,ctype=3,H136)","v":56.432432432432435},{"$f":"+D138*$B$126","v":22.245000000000001}]
[null,null,null,{"$f":"+B48","v":3.2560958801498128},{"$f":"+B53*1000","v":683.10991957104557},"Total",{"$f":"SUM(G133:G136)","v":2059.6335071330122},{"$f":"SUM(H133:H136)","v":1348.5796264580279}]
[null,null,null,{"$f":"+B60","v":1.5},{"$f":"+B67*1000","v":352.70270270270271}]
[]
[]
[null,null,null,null,null,null,"NOx/SOx"]
[null,null,null,null,null,null,"Current Home","Gas Home"]
[null,null,null,null,null,"NOx",{"$f":"'Carbon Calculator'!E132","v":9.6511337781443931},{"$f":"'Carbon Calculator'!I132","v":11.223354273464889}]
[null,null,null,null,null,"SOx",{"$f":"'Carbon Calculator'!E131","v":7.7073138763491134},{"$f":"'Carbon Calculator'!I131","v":5.3491714983857366E-2}]
[null,null,null,null,null,"Total",{"$f":"SUM(G143:G144)","v":17.358447654493506},{"$f":"SUM(H143:H144)","v":11.276845988448747}]
[]
[]
[null,null,null,null,null,null,"lbs/yr"]
[null,null,null,null,null,null,"Current Home","Gas Home"]
[null,null,null,null,null,"Space Heating",{"$f":"_xlfn.IFS(heattype=1,B20,heattype=2,G12,heattype=3,G18,heattype=4,J11)","v":9896.64072606021},{"$f":"B11","v":7299.7982481940098}]
[null,null,null,null,null,"Water Heating",{"$f":"_xlfn.IFS(wheattype=1,B39,wheattype=2,G30,wheattype=3,G39,wheattype=4,J29)","v":5980.7876676579817},{"$f":"B32","v":2839.0040567951319}]
[null,null,null,null,null,"Clothes Drying",{"$f":"_xlfn.IFS(dtype=1,B56,dtype=2,G44,dtype=3,B49)","v":916.28988735416783},{"$f":"B49","v":383.07010354703675}]
[null,null,null,null,null,"Cooking",{"$f":"_xlfn.IFS(ctype=1,B70,ctype=2,G61,ctype=3,G67)","v":473.09797511344505},176]
[null,null,null,null,null,"Total",{"$f":"SUM(G150:G153)","v":17266.816256185804},{"$f":"SUM(H150:H153)","v":10697.872408536179}]

{"sheet":"Carbon Calculator","index":8,"n_rows":208,"n_cols":107,"rows_kept":208,"cut":false,"hidden":false,"merged":[[68,2,68,3],[68,8,68,10],[68,12,68,18],[9,8,9,18],[26,8,26,18],[34,4,39,4],[40,4,45,4],[46,4,51,4],[53,4,58,4],[67,2,67,3],[67,8,67,10],[67,12,67,18],[69,2,69,3],[69,8,69,10],[69,12,69,18],[70,2,70,3],[70,8,70,10],[70,12,70,18],[71,2,71,3],[71,8,71,10],[71,12,71,18],[72,2,72,3],[72,8,72,10],[72,12,72,18],[73,2,73,3],[73,8,73,10],[73,12,73,18],[74,2,74,3],[74,8,74,10],[74,12,74,18],[75,2,75,3],[75,8,75,10],[75,12,75,18],[76,2,76,3],[76,8,76,10],[76,12,76,18],[77,2,77,3],[77,8,77,10],[77,12,77,18],[78,2,78,3],[78,8,78,10],[78,12,78,18],[79,2,79,3],[79,8,79,10],[79,12,79,18],[80,2,80,3],[80,8,80,10],[80,12,80,19],[81,2,81,3],[81,8,81,10],[81,12,81,19],[82,2,82,3],[82,8,82,10],[82,12,82,19],[83,2,83,3],[83,8,83,10],[83,12,83,19],[84,2,84,3],[84,8,84,10],[84,12,84,18]]}
[]
[null,null,"Commercial Carbon Calculator ",null,null,null,null,null,null,null,null,null,null,null,null,null,null,null,null,null,null,"To update carbon calculator, ONLY update the table below and the table in columns BS:BW (Canada). Both are highlighted in blue"]
[null,null,null,null,null,null,null,null,null,null,null,"Developed by:"]
[null,null,null,null,null,null,null,null,null,null,null,null,null,null,null,null,null,null,null,null,null,"eGRID2023 (v2, 2025 Release), 2022 for Canada",null,null,null,null,null,null,null,null,null,null,null,null,null,null,null,null,null,null,null,null,null,null,null,null,null,null,null,null,null,null,null,null,"Canada Data",null,null,null,null,null,null,null,null,null,null,null,null,null,null,null,null,null,null,null,null,null,"Emissions Summary",null,"*values in columns BZ-CC are the ones used in calculations, but they are pulled from table starting in AF",null,null,null,null,"Other Data",null,null,null,null,null,null,null,null,null,"Lists"]
[null,null,null,null,null,null,null,null,null,null,null,null,null,null,null,null,null,null,null,null,null,null,null,null,null,null,null,null,null,null,null,null,null,null,null,null,null,null,null,null,null,null,null,null,null,null,null,null,null,null,null,null,null,null,null,null,null,null,null,null,null,null,null,null,null,null,null,null,null,null,null,null,null,null,null,null,null,null,"*only blue highlighted values are used for calcilations"]
[null,null,null,null,null,null,null,null,null,null,null,null,null,null,null,null,null,null,null,null,null,null,null,null,null,null,null,null,null,null,null,null,null,null,null,null,null,null,null,null,null,null,null,null,null,null,null,null,null,null,null,null,null,null,"CO2 Emissions",null,null,null,null,null,null,"SOX and NOX Emissions",null,null,null,null,null,null,null,null,"Canadian Average All Sources",null,null,null,null,null,"eGRID2023 US, NIR (2022) and NPRI Canada (2011)",null,null,null,null,null,null,"NOX Emission Factors, EPA AP-42 Section 1.4 Natural Gas Combustion, Table 3.4-1",null,null,null,null,null,"Unit Conversions",null,null,null,"Consumption",null,"Regions",null,null,"Emissions Profile"]
[null,null,null,null,null,null,null,null,null,null,null,null,null,null,null,null,null,null,null,null,null,"*update table below",null,null,null,null,null,null,null,null,null,null,null,null,null,null,null,null,null,null,null,null,null,null,null,null,null,null,null,null,null,null,null,null,null,null,null,null,null,null,null,null,null,null,null,null,null,null,null,null,"*update table below"]
[null,null,null,null,null,null,null,null,null,null,null,null,null,null,null,null,null,null,null,null,null,"eGRID2023 (2025 release)","State abbreviation","State nameplate capacity (MW)","State annual heat input (MMBtu)","State annual net generation (MWh)","State annual NOx emissions (tons)","State annual SO2 emissions (tons)","State annual CO2 emissions (tons)","State annual NOx total output emission rate (lb/MWh)","State annual SO2 total output emission rate (lb/MWh)","State annual CO2 total output emission rate (lb/MWh)","State annual NOx input emission rate (lb/MMBtu)","State ozone season NOx input emission rate (lb/MMBtu)","State annual SO2 input emission rate (lb/MMBtu)","State annual CO2 input emission rate (lb/MMBtu)","State annual NOx fossil fuel output emission rate (lb/MWh)","State annual SO2 fossil fuel output emission rate (lb/MWh)","State annual CO2 fossil fuel output emission rate (lb/MWh)","State annual NOx fossil fuel input emission rate (lb/MMBtu)","State annual SO2 fossil fuel input emission rate (lb/MMBtu)","State annual CO2 fossil fuel input emission rate (lb/MMBtu)","State annual coal net generation (MWh)","State annual oil net generation (MWh)","State annual gas net generation (MWh)","State annual other fossil net generation (MWh)","State coal generation percent (resource mix)","State oil generation percent (resource mix)","State gas generation percent (resource mix)","State other fossil  generation percent (resource mix)","State total combustion generation percent (resource mix)","Total Annual Heat Rate (Btu/kWh)","Fossil Annual Heat Rate (Btu/kWh)",null,null,"CO2 - g CO2 eq/kWh",null,"CO2 - lb CO2 eq/MWh",null,null,null,null,"SOX (t)1","NOX (t)1","SOX (pounds)","NOX (pounds)","Generation (GWh)2","SO2 output emission rate (lb/MWh)","NOX output emission rate (lb/MWh)",null,"Canada Province","2022 CO2 Emission Rate (lb/MWh)1","2011 NOX Emission Rate (lb/MWh)2","2011 SO2 Emission Rate (lb/MWh)2,3","Province Annual Heat Rate (Btu/kWh)",null,"State","CO2 Emission Rate (lb/MWh)","SO2 Emission Rate (lb/MWh)","NOX Emission Rate (lb/MWh)","Annual Heat Rate (Btu/kWh)",null,null,"Pollutant","# of Tests","Emission Factor (lb/106 scf)","Relative St. Dev (%)",null,null,"Value","Units",null,null,"Monthly",null,"US Average",{"$f":"CR8","v":"US Average"},1,"eGrid Subregions Ave All Sources",null,"US_Average_All_Sources","US_Average_Fossil","eGrid_Subregions_Ave_All_Sources","eGrid_Subregions_Average_Fossil","NERC_Average_All_Sources","NERC_Average_Fossil","Canadian_Average_All_Sources"]
[null,null,"User Input",null,null,null,null,null,null,null,null,null,null,null,null,null,null,null,null,null,null,"N/A","US Average",1303568.8,21889487792.688,4190970937.3569999,947487.39800000004,752518.80500000005,1607676335.9419999,0.45200000000000001,0.35899999999999999,767.20899999999995,8.6999999999999994E-2,8.2000000000000003E-2,6.9000000000000006E-2,146.88999999999999,0.71,0.56699999999999995,1270.259,8.4000000000000005E-2,6.7000000000000004E-2,149.90600000000001,674702091.56400001,23005568.559999999,1809177398.984,19169271.316,0.161,5.0000000000000001E-3,0.432,5.0000000000000001E-3,0.61399999999999999,{"$f":"Y9/Z9*1000","v":5223.0111160094129},{"$f":"Y9/(SUM(AQ9:AT9))*1000","v":8665.4857455159454},null,null,"Generation Intensity","Consumption Intensity","Generation Intensity","Consumption Intensity","Losses1",null,"Canada Average",294098.96720494935,184706.73658799267,648376465.07937539,407208165.6166203,568000,{"$f":"BM9/$BO9/1000","v":1.1415078610552385},0.71691578453630334,null,"Canada Average",220.46244201837774,0.71691578453630334,1.1415078610552385,3634,null,{"$f":"W9","v":"US Average"},{"$f":"AF9","v":767.20899999999995},{"$f":"AE9","v":0.35899999999999999},{"$f":"AD9","v":0.45200000000000001},{"$f":"AZ9","v":5223.0111160094129},null,null,"NOx (Small-Unc.)",18,104,0.51,null,null,1.1023099999999999,"short ton/metric ton",null,null,"Annual",null,"Alaska","AK",2,"eGrid Subregions Average Fossil",null,"US Average",{"$f":"CW9","v":"US Average"},"ASCC Alaska Grid","ASCC Alaska Grid","Alaska Systems Coordinating Council","Alaska Systems Coordinating Council","Canada Average"]
[null,null,null,null,null,null,null,null,"Comparison Cases",null,null,null,null,null,null,null,null,null,null,null,null,1,"AK",3095.5,39933923.741999999,6678905.1610000003,20591.981,1349.979,2704368.9870000002,6.1660000000000004,0.40400000000000003,809.82399999999996,1.0309999999999999,1.107,6.8000000000000005E-2,135.44200000000001,8.6310000000000002,0.56299999999999994,1134.6969999999999,1.0409999999999999,6.8000000000000005E-2,136.80500000000001,730681.46,848592.32499999995,3182407.1030000001,0,0.109,0.127,0.47599999999999998,0,0.71899999999999997,{"$f":"Y10/Z10*1000","v":5979.1122615702616},{"$f":"Y10/(SUM(AQ10:AT10))*1000","v":8386.5182655642075},null,"Canada Average",100,100,220.46244201837774,220.46244201837774,{"$f":"IF(BD10=0,0,BE10/BD10-1)","v":0},null,"Alberta",114491.81096,84030.117501149434,252410936.27863517,185254477.64538407,64600,3.9072900352729905,2.8677163722195678,null,"Alberta",1036.1734774863755,2.8677163722195678,3.9072900352729905,10177,null,{"$f":"W10","v":"AK"},809.82399999999996,0.40400000000000003,6.1660000000000004,5979.1122615702616,null,null,"NOx (Small-Low NOx)",5,50,0.54,null,null,9.9975999999999995E-2,"mmbtu/therm",null,null,null,null,"Alabama","AL",3,"Canadian Average All Sources",null,"Alaska","Alaska","ASCC Miscellaneous","ASCC Miscellaneous","Hawaiian Islands Coordinating Council","Hawaiian Islands Coordinating Council","Alberta"]
[null,null,"Description",null,"Current Home",null,null,null,"Gas Alternative",null,null,null,null,null,null,null,"#5",null,"#6",null,null,2,"AL",32924,685579327.98000002,138596256.477,14811.073,6423.2849999999999,49270107.590999998,0.214,9.2999999999999999E-2,710.98800000000006,4.2999999999999997E-2,4.5999999999999999E-2,1.9E-2,143.733,0.33100000000000002,5.7000000000000002E-2,1232.6890000000001,0.04,7.0000000000000001E-3,147.88499999999999,18975689.600000001,23792.080000000002,61216629.167999998,31.529,0.13700000000000001,0,0.442,0,0.60199999999999998,4946.5934030748631,8546.6504330002917,null,"Alberta",470,490,1036.1734774863755,1080.2659658900511,{"$f":"IF(BD11=0,0,BE11/BD11-1)","v":4.2553191489361764E-2},null,"British Columbia",138.70479504146181,2088.8573668881386,305791.3652443075,4605136.7281889282,56300,5.4314629705916077E-3,8.1796389488258042E-2,null,"British Columbia",30.864741882572886,8.1796389488258042E-2,5.4314629705916077E-3,437,null,"AL",710.98800000000006,9.2999999999999999E-2,0.214,4946.5934030748631,null,null,"NOx (Small-Low NOx/FGR)",15,32,0.18,null,null,2000,"pounds/short ton",null,null,null,null,"Arkansas","AR",null,null,null,"Alabama","Alabama","ERCOT All","ERCOT All","Midwest Reliability Organization","Midwest Reliability Organization","British Columbia"]
[null,null,null,null,null,null,null,null,null,null,null,null,null,null,null,null,null,null,null,null,null,3,"AR",17060.099999999999,387817293.43800002,63195646.552000001,15231.232,27092.375,31389681.647,0.48199999999999998,0.85699999999999998,993.41300000000001,7.9000000000000001E-2,8.3000000000000004E-2,0.14000000000000001,161.87899999999999,0.68500000000000005,1.2010000000000001,1450.0160000000001,7.6999999999999999E-2,0.13600000000000001,163.68299999999999,16844436.438999999,44534.565999999999,26487466.594000001,6914.3739999999998,0.26700000000000002,1E-3,0.41899999999999998,0,0.69799999999999995,6136.7723031188216,8939.3114132665778,null,"British Columbia",14,15,30.864741882572886,33.069366302756663,7.1428571428571397E-2,null,"Manitoba",664.74159214250608,442.07568449616576,1465502.6088692115,974608.89555393695,35100,4.1752211078894916E-2,2.7766635200966863E-2,null,"Manitoba",2.866011746238911,2.7766635200966863E-2,4.1752211078894916E-2,300,null,"AR",993.41300000000001,0.85699999999999998,0.48199999999999998,6136.7723031188216,null,null,"NOx (Large Wall-Fired-Low NOx)",5,136,0.37,null,null,453.59199999999998,"grams/pound",null,null,null,null,"Arizona","AZ",null,null,null,"Arkansas","Arkansas","FRCC All","FRCC All","Northeast Power Coordinating Council","Northeast Power Coordinating Council","Manitoba"]
[null,null,"Electricity Consumption (kWh/yr)",null,{"$f":"Calc!B77*1000","v":12872.709419581324},null,null,"% zero-carbon",null,null,null,null,null,null,null,null,null,null,null,null,null,4,"AZ",33107.599999999999,544411241.40799999,111820945.514,16561.587,7036.3410000000003,38393040.736000001,0.29599999999999999,0.126,686.68799999999999,6.0999999999999999E-2,5.8999999999999997E-2,2.5999999999999999E-2,141.04400000000001,0.503,0.215,1182.5809999999999,0.06,2.5999999999999999E-2,141.96299999999999,12068553.369999999,31568.289000000001,52817502.637000002,0,0.108,0,0.47199999999999998,0,0.58199999999999996,4868.5980869285313,8386.1855283811528,null,"Manitoba",1.3,1.4,2.866011746238911,3.0864741882572888,7.6923076923076872E-2,null,"New Brunswick",4865.954167387863,7004.945850948815,10727579.87650663,15443243.721918777,11200,0.95781963183094909,1.3788610465998909,null,"New Brunswick",727.52605866064664,1.3788610465998909,0.95781963183094909,2720,null,"AZ",686.68799999999999,0.126,0.29599999999999999,4868.5980869285313,null,null,"NOx (Large Wall-Fired-FGR)",4,101,0.25,null,null,null,null,null,null,null,null,"California","CA",null,null,null,"Arizona","Arizona","HICC Miscellaneous","HICC Miscellaneous","Reliability First Corporation","Reliability First Corporation","New Brunswick"]
[null,null,null,null,null,null,null,"(onsite PV)",null,null,null,null,null,null,null,null,null,null,null,null,null,5,"CA",96731,772978111.95599997,216080235.82499999,31751.932000000001,1366.1990000000001,42512302.211999997,0.29399999999999998,1.2999999999999999E-2,393.48599999999999,8.2000000000000003E-2,8.4000000000000005E-2,4.0000000000000001E-3,109.996,0.52300000000000002,7.0000000000000001E-3,873.41,7.0999999999999994E-2,1E-3,118.19,208861.65,73419.430999999997,94336387.003999993,1483673.1740000001,1E-3,0,0.437,7.0000000000000001E-3,0.46800000000000003,3577.2735484332907,8043.2807549692297,null,"New Brunswick",330,350,727.52605866064664,771.61854706432212,6.0606060606060552E-2,null,"Newfoundland",3063.0639999999999,3269.4462551396086,6752892.1556799989,7207886.6030058833,41300,0.16350828464116218,0.17452509934638943,null,"Newfoundland",37.478615143124216,0.17452509934638943,0.16350828464116218,365,null,"CA",393.48599999999999,1.2999999999999999E-2,0.29399999999999998,3577.2735484332907,null,null,"NOx (Large Wall-Fired Unc. Pre-NSPS)",108,275,0.93,null,null,null,null,null,null,null,null,"Colorado","CO",null,null,null,"California","California","HICC Oahu","HICC Oahu","SERC Reliability Corporation","SERC Reliability Corporation","Newfoundland"]
[null,null,"Natural Gas Consumption (MMBtu/yr)",null,{"$f":"Calc!I79","v":0},null,null,"% zero-carbon",{"$f":"Calc!B76","v":90.935915472557525},null,null,null,null,null,null,null,null,null,null,null,null,6,"CO",21370,363925196.50700003,57471488.483000003,15627.909,10073.944,31178885.504000001,0.54400000000000004,0.35099999999999998,1085.021,8.5999999999999993E-2,8.3000000000000004E-2,5.5E-2,171.34800000000001,0.86,0.55900000000000005,1732.3340000000001,8.5000000000000006E-2,5.6000000000000001E-2,172.13399999999999,18730017.170000002,47733.339,17218649.954999998,0,0.32600000000000001,1E-3,0.3,0,0.629,6332.273725860583,10110.044110409362,null,"Newfoundland",17,18,37.478615143124216,39.683239563308,5.8823529411764719E-2,null,"Nova Scotia",65035.813008830861,18433.879842248083,143379254.07552868,40639700.177816965,11400,12.577127550484972,3.5648859805102604,null,"Nova Scotia",1455.0521173212933,3.5648859805102604,12.577127550484972,5979,null,"CO",1085.021,0.35099999999999998,0.54400000000000004,6332.273725860583,null,null,"NOx (Large Wall-Fired Unc. Post-NSPS)",13,192,0.36,null,null,null,null,null,null,null,null,"Connecticut","CT",null,null,null,"Colorado","Colorado","MRO East","MRO East","Texas Regional Entity","Texas Regional Entity","Nova Scotia"]
[null,null,null,null,null,null,null,"(RNG, Hydrogen)",null,null,null,null,null,null,null,null,null,null,null,null,null,7,"CT",10965.2,189301265.22600001,40652074.994999997,3890.7220000000002,1459.145,10940807.505999999,0.191,7.1999999999999995E-2,538.26599999999996,4.1000000000000002E-2,3.9E-2,1.4999999999999999E-2,115.59099999999999,0.16600000000000001,1.7999999999999999E-2,810.03,2.4E-2,3.0000000000000001E-3,118.077,0,124203.807,24943869.370000001,429483.83500000002,0,3.0000000000000001E-3,0.61399999999999999,1.0999999999999999E-2,0.64200000000000002,4656.6199941647046,7424.2903011025137,null,"Nova Scotia",660,700,1455.0521173212933,1543.2370941286442,6.0606060606060552E-2,null,"Ontario",11970.557780341796,18987.876697569071,26390531.093697131,41861052.724994719,151000,0.17477172909733199,0.27722551473506435,null,"Ontario",77.161854706432209,0.27722551473506435,0.17477172909733199,2686,null,"CT",538.26599999999996,7.1999999999999995E-2,0.191,4656.6199941647046,null,null,"NOx (Tangential-Unc.)",62,167,0.37,null,null,null,null,null,null,null,null,"District of Columbia","DC",null,null,null,"Connecticut","Connecticut","MRO West","MRO West","Western Electricity Coordinating Council","Western Electricity Coordinating Council","Ontario"]
[null,null,"Propane Consumption (gal/yr)",null,{"$f":"Calc!I76","v":0},null,null,"% zero-carbon",null,null,null,null,null,null,null,null,null,null,null,null,null,8,"DC",56.6,1490126.7350000001,171869.49900000001,243.65199999999999,2.3570000000000002,33866.771999999997,2.835,2.7E-2,394.09899999999999,0.32700000000000001,0.32,3.0000000000000001E-3,45.454999999999998,2.6579999999999999,2.1000000000000001E-2,758.14499999999998,0.22600000000000001,2E-3,64.361999999999995,0,53.575000000000003,89209.785000000003,0,0,0,0.51900000000000002,0,0.85699999999999998,8670.1057701925347,16693.59897498817,null,"Ontario",35,38,77.161854706432209,83.775727966983553,8.5714285714285632E-2,null,"Prince Edward Island",65.63,26.841000000000001,144689.21059999996,59174.205419999998,492,0.29408376138211373,0.12027277524390242,null,"Prince Edward Island",4.4092488403675549,0.12027277524390242,0.29408376138211373,7864,null,"DC",394.09899999999999,2.7E-2,2.835,8670.1057701925347,null,null,"NOx (Tangential-FGR)",8,76,0.64,null,null,null,null,null,null,null,null,"Delaware","DE",null,null,null,"District of Columbia","District of Columbia","NPCC Long Island","NPCC Long Island",null,null,"Prince Edward Island"]
[null,null,null,null,null,null,null,"(Renewable Propane)",null,null,null,null,null,null,null,null,null,null,null,null,null,9,"DE",3441,28665227.745999999,4772059.2589999996,540.40599999999995,175.387,1677842.733,0.22600000000000001,7.3999999999999996E-2,703.19399999999996,3.7999999999999999E-2,0.04,1.2E-2,117.065,0.316,9.8000000000000004E-2,984.53700000000003,3.9E-2,1.2E-2,119.92,-6498.4170000000004,-1890.86,4382640.0319999997,172094.23,0,0,0.91800000000000004,3.5999999999999997E-2,0.96699999999999997,6006.8884710385792,6305.1149529076038,null,"Prince Edward Island",2,0,4.4092488403675549,0,-1,null,"Quebec",1622.9466400000001,8275.0073475669069,3577980.6214768002,18243246.698592953,177000,2.0214579782354802E-2,0.1030691903875308,null,"Quebec",2.6455493042205331,0.1030691903875308,2.0214579782354802E-2,101,null,"DE",703.19399999999996,7.3999999999999996E-2,0.22600000000000001,6006.8884710385792,null,null,null,null,null,null,null,null,null,null,null,null,null,null,"Florida","FL",null,null,null,"Delaware","Delaware","NPCC New England","NPCC New England",null,null,"Quebec"]
[null,null,"Heating Oil Consumption (gal/yr)",null,{"$f":"Calc!E76","v":0},null,null,"% zero-carbon",null,null,null,null,null,null,null,null,null,null,null,null,null,10,"FL",76100.7,1625654877.3559999,258099011.94999999,32830.269999999997,16292.59,101516103.816,0.254,0.126,786.64499999999998,0.04,0.04,0.02,124.893,0.23200000000000001,0.107,949.63699999999994,3.1E-2,1.4E-2,126.67,11373250.602,1199820.9140000001,195830251.875,1459664.6680000001,4.3999999999999997E-2,5.0000000000000001E-3,0.75900000000000001,6.0000000000000001E-3,0.82499999999999996,6298.5707115799751,7746.2676596359624,null,"Quebec",1.2,1.7,2.6455493042205331,3.7478615143124219,0.41666666666666674,null,"Saskatchewan",91918.95660869655,36803.729927236527,202646370.11866456,81138239.072184175,20800,9.7426139480127194,3.9008768784703931,null,"Saskatchewan",1388.9133847157798,3.9008768784703931,9.7426139480127194,5711,null,"FL",786.64499999999998,0.126,0.254,6298.5707115799751,null,null,null,null,null,null,null,null,null,null,null,null,null,null,"Georgia","GA",null,null,null,"Florida","Florida","NPCC NYC/Westchester","NPCC NYC/Westchester",null,null,"Saskatchewan"]
[null,null,null,null,null,null,null,"(Biofuels)",null,null,null,null,null,null,null,null,null,null,null,null,null,11,"GA",40609.5,676426975.28699994,129220273.258,18438.114000000001,12892.404,46120743.101999998,0.28499999999999998,0.2,713.83100000000002,5.5E-2,3.9E-2,3.7999999999999999E-2,136.36600000000001,0.39500000000000002,0.217,1194.4459999999999,4.8000000000000001E-2,2.5999999999999999E-2,145.172,16769056.525,235786.7,60043962.582999997,90858.002999999997,0.13,2E-3,0.46500000000000002,1E-3,0.63500000000000001,5234.6815111314008,8768.8608151613753,null,"Saskatchewan",630,670,1388.9133847157798,1477.098361523131,6.3492063492063489E-2,null,null,null,null,null,null,null,null,null,null,null,null,null,null,null,null,"GA",713.83100000000002,0.2,0.28499999999999998,5234.6815111314008,null,null,null,null,null,null,null,null,null,null,null,null,null,null,"Hawaii","HI",null,null,null,"Georgia","Georgia","NPCC Upstate NY","NPCC Upstate NY"]
[null,null,null,null,null,null,null,null,null,null,null,null,null,null,null,null,null,null,null,null,null,12,"HI",3451.2,81226059.821999997,9158617.7329999991,22671.584999999999,19871.901999999998,6342943.2209999999,4.9509999999999996,4.3390000000000004,1385.1310000000001,0.55800000000000005,0.54500000000000004,0.48899999999999999,156.18,6.0140000000000002,5.35,1650.194,0.59,0.52500000000000002,161.90600000000001,0,7159456.4289999995,0,177774.96,0,0.78200000000000003,0,1.9E-2,0.83299999999999996,8868.812105709927,11070.39638190699,null,null,null,null,null,null,null,null,"1 2011 metric tons, taken from National Pollutant Release Inventory (NPRI) Downloadable Datasets, 2011 Air Pollutant Emission Summaries and Trends. 2011 Emissions from Electric Power Generation (Utilities)",null,null,null,null,null,null,null,null,"1 2020 CO2 Emission Rate taken from Canada's Official Greenhouse Gas Inventory, https://data.ec.gc.ca/data/substances/monitor/canada-s-official-greenhouse-gas-inventory ",null,null,null,null,null,"HI",1385.1310000000001,4.3390000000000004,4.9509999999999996,8868.812105709927,null,null,null,null,null,null,null,null,null,null,null,null,null,null,"Iowa","IA",null,null,null,"Hawaii","Hawaii","RFC East","RFC East"]
[null,null,"Emissions Profile",null,{"$f":"LOOKUP(emisProfile,CT8:CT10,CU8:CU10)","v":"eGrid Subregions Average Fossil"},null,null,null,null,null,null,null,null,null,null,null,null,null,null,null,null,13,"IA",24260.7,246426779.24200001,69819809.047999993,13468.464,18148.432000000001,21999770.945999999,0.38600000000000001,0.52,630.18700000000001,0.109,0.114,0.14699999999999999,178.55,1,1.3520000000000001,1641.0650000000001,0.109,0.14799999999999999,179.423,16409804.416999999,63157.552000000003,10235259.619000001,0,0.23499999999999999,1E-3,0.14699999999999999,0,0.38600000000000001,3529.4679633481319,9226.6262817259067,null,"1 Losses include transmission line losses, metering differences, and other losses",null,null,null,null,null,null,"http://www.ec.gc.ca/inrp-npri/default.asp?lang=en&n=0EC58C98-#Emission_Summaries",null,null,null,null,null,null,null,null,"2 NOX and SOX Emissions taken from National Pollutant Release Inventory (NPRI) Downloadable Datasets, 2011 Air Pollutant Emission Summaries and Trends. 2011 Emissions from Electric Power Generation (Utilities)",null,null,null,null,null,"IA",630.18700000000001,0.52,0.38600000000000001,3529.4679633481319,null,null,null,null,null,null,null,null,null,null,null,null,null,null,"Idaho","ID",null,null,null,"Iowa","Iowa","RFC Michigan","RFC Michigan"]
[null,null,null,null,null,null,null,null,null,null,null,null,null,null,null,null,null,null,null,null,null,14,"ID",5509,49765574.122000001,17842445.936999999,1179.3330000000001,436.46600000000001,2794952.09,0.13200000000000001,4.9000000000000002E-2,313.29199999999997,4.7E-2,4.5999999999999999E-2,1.7999999999999999E-2,112.325,0.22600000000000001,5.0000000000000001E-3,981.77499999999998,2.7E-2,1E-3,118.82899999999999,0,123.38500000000001,5686224.4289999995,0,0,0,0.31900000000000001,0,0.34399999999999997,2789.1677126397117,8751.7640056197961,null,"Source: Canada's Official Greenhouse Gas Inventory, 2022 data, ",null,null,null,null,null,null,"2 2011 Generation, taken from National Inventory Report, Greenhouse Gas Sources and Sinks in Canada 1990-2011, Environment Canada, Part 3",null,null,null,null,null,null,null,null,"http://www.ec.gc.ca/inrp-npri/default.asp?lang=en&n=0EC58C98-#Emission_Summaries",null,null,null,null,null,"ID",313.29199999999997,4.9000000000000002E-2,0.13200000000000001,2789.1677126397117,null,null,null,null,null,null,null,null,null,null,null,null,null,null,"Illinois","IL",null,null,null,"Idaho","Idaho","RFC West","RFC West"]
[null,null,"Region",null,{"$f":"_xlfn.IFS(state=1,\"US Average\",state<53,_xlfn.XLOOKUP('Heating Load'!C2,Lists!D119:D346,Lists!J119:J346),state=53,\"Canada Average\",state>53,_xlfn.XLOOKUP(state,Lists!A74:A83,Lists!B74:B83))","v":"US Average"},null,null,null,null,null,null,null,null,null,null,null,null,null,null,null,null,15,"IL",51850.5,505773729.73699999,177690286.567,14983.831,23974.718000000001,41908695.063000001,0.16900000000000001,0.27,471.70499999999998,5.8999999999999997E-2,5.3999999999999999E-2,9.5000000000000001E-2,165.721,0.53200000000000003,0.85499999999999998,1498.7180000000001,5.8999999999999997E-2,9.5000000000000001E-2,167.00299999999999,27149579.037,26287.541000000001,28416900.384,248087.87599999999,0.153,0,0.16,1E-3,0.316,2846.3780407394001,9057.4138093748934,null,"https://data.ec.gc.ca/data/substances/monitor/canada-s-official-greenhouse-gas-inventory/C-Tables-Electricity-Canada-Provinces-Territories/?lang=en ",null,null,null,null,null,null,null,null,null,null,null,null,null,null,null,"3 SOX emissions used to estimate SO2 emissions",null,null,null,null,null,"IL",471.70499999999998,0.27,0.16900000000000001,2846.3780407394001,null,null,null,null,null,null,null,null,null,null,null,null,null,null,"Indiana","IN",null,null,null,"Illinois","Illinois","SERC Midwest","SERC Midwest"]
[null,null,null,null,null,{"$f":"IF(#REF!=\"Ontario\",\"Y\",IF(#REF!=\"Alberta\",\"Y\",IF(#REF!=\"New Brunswick\",\"Y\",IF(#REF!=\"Nova Scotia\",\"Y\",\"N\"))))","v":{"$error":"#REF!"}},null,null,null,null,null,null,null,null,null,null,null,null,null,null,null,16,"IN",30220.7,718341510.49600005,90031870.695999995,37124.163999999997,24608.620999999999,65596778.472999997,0.82499999999999996,0.54700000000000004,1457.19,0.10299999999999999,7.3999999999999996E-2,6.9000000000000006E-2,182.63399999999999,0.95,0.65500000000000003,1682.347,0.10199999999999999,7.0000000000000007E-2,180.98500000000001,40931630.140000001,96718.152000000002,34849282.178999998,2271502.2000000002,0.45500000000000002,1E-3,0.38700000000000001,2.5000000000000001E-2,0.871,7978.7469142070722,9191.9319632137904,null,null,null,null,null,null,null,null,null,null,null,null,null,null,null,null,null,null,null,null,null,null,null,"IN",1457.19,0.54700000000000004,0.82499999999999996,7978.7469142070722,null,null,null,null,null,null,null,null,null,null,null,null,null,null,"Kansas","KS",null,null,null,"Indiana","Indiana","SERC Mississippi Valley","SERC Mississippi Valley"]
[null,null,null,null,{"$f":"IF(F25=\"Y\",\"Note that Ontario, NewBrunswick, Nova Scotia and Alberta use calculated marginal mix emissions for CO2.\",\" \")","v":{"$error":"#REF!"}},null,null,null,null,null,null,null,null,null,null,null,null,null,null,null,null,17,"KS",20569.599999999999,224582486.59200001,58456598.044,14484.647000000001,3295.7339999999999,21282869.074000001,0.496,0.113,728.16,0.129,0.128,2.9000000000000001E-2,189.53299999999999,1.3979999999999999,0.317,2054.4630000000002,0.129,2.9000000000000001E-2,190.17699999999999,16290683.67,59081.285000000003,4368902.1239999998,0,0.27900000000000003,1E-3,7.4999999999999997E-2,0,0.35599999999999998,3841.867199027864,10839.620412629345,null,null,null,null,null,null,null,null,null,null,null,null,null,null,null,null,null,null,null,null,null,null,null,"KS",728.16,0.113,0.496,3841.867199027864,null,null,null,null,null,null,null,null,null,null,null,null,null,null,"Kentucky","KY",null,null,null,"Kansas","Kansas","SERC South","SERC South"]
[null,null,"Annual Results",null,null,null,"Current",null,{"$f":"I10","v":"Comparison Cases"},null,null,null,null,null,null,null,null,null,null,null,null,18,"KY",21645.3,577480223.31599998,62417958.511,29920.167000000001,34820.714999999997,54147851.833999999,0.95899999999999996,1.1160000000000001,1735.009,0.104,0.09,0.121,187.53100000000001,1.028,1.1890000000000001,1870.3589999999999,0.104,0.12,188.518,42805601.332000002,61135.461000000003,14932901.161,91123.23,0.68600000000000005,1E-3,0.23899999999999999,1E-3,0.93400000000000005,9251.8281131259664,9975.3434141336784,null,null,null,null,null,null,null,null,null,null,null,null,null,null,null,null,null,null,null,null,null,null,null,"KY",1735.009,1.1160000000000001,0.95899999999999996,9251.8281131259664,null,null,null,null,null,null,null,null,null,null,null,null,null,null,"Louisiana","LA",null,null,null,"Kentucky","Kentucky","SERC Tennessee Valley","SERC Tennessee Valley"]
[null,null,null,null,"Units",null,"Home",null,{"$f":"I11","v":"Gas Alternative"},null,{"$f":"K11","v":0},null,{"$f":"M11","v":0},null,{"$f":"O11","v":0},null,{"$f":"Q11","v":"#5"},null,{"$f":"S11","v":"#6"},null,null,19,"LA",28657.7,602670647.20700002,97434806.409999996,32219.460999999999,9345.9470000000001,37093620.722000003,0.66100000000000003,0.192,761.404,0.107,0.106,3.1E-2,123.09699999999999,0.78500000000000003,0.19,916.52200000000005,0.107,2.5999999999999999E-2,125.377,4833626.99,1032442.537,74064692.790999994,1822326.763,0.05,1.0999999999999999E-2,0.76,1.9E-2,0.85899999999999999,6185.3732707282961,7371.8394495146367,null,null,null,null,null,null,null,null,null,null,null,null,null,null,null,null,null,null,null,null,null,null,null,"LA",761.404,0.192,0.66100000000000003,6185.3732707282961,null,null,null,null,null,null,null,null,null,null,null,null,null,null,"Massachusetts","MA",null,null,null,"Louisiana","Louisiana","SERC Virginia/Carolina","SERC Virginia/Carolina"]
[null,null,"Energy Consumption",null,null,null,null,null,null,null,null,null,null,null,null,null,null,null,null,null,null,20,"MA",14490,139819930.62,19663313.081,5834.6869999999999,2736.2809999999999,8085460.8550000004,0.59299999999999997,0.27800000000000002,822.39,8.3000000000000004E-2,7.9000000000000001E-2,3.9E-2,115.655,0.22600000000000001,1.6E-2,861.47699999999998,3.1E-2,2E-3,119.15,0,97476.179000000004,14774025.57,934699.58,0,5.0000000000000001E-3,0.751,4.8000000000000001E-2,0.85,7110.7005235604629,8845.8907810739565,null,null,null,null,null,null,null,null,null,null,null,null,null,null,null,null,null,null,null,null,null,null,null,"MA",822.39,0.27800000000000002,0.59299999999999997,7110.7005235604629,null,null,null,null,null,null,null,null,null,null,null,null,null,null,"Maryland","MD",null,null,null,"Massachusetts","Massachusetts","SPP North","SPP North"]
[null,null,"Electricity (generated at central power plant)",null,null,null,{"$f":"E114","v":117.79121434165873},null,{"$f":"I114","v":0},null,{"$f":"K114","v":0},null,{"$f":"M114","v":0},null,{"$f":"O114","v":0},null,{"$f":"Q114","v":0},null,{"$f":"S114","v":0},null,null,21,"MD",13152.7,146699411.24399999,35987133.296999998,3131.6860000000001,2081.576,9357054.4910000004,0.17399999999999999,0.11600000000000001,520.02200000000005,4.2999999999999997E-2,0.05,2.8000000000000001E-2,127.568,0.28399999999999997,0.17199999999999999,1045.885,3.5000000000000003E-2,2.1000000000000001E-2,129.16900000000001,1708970.4380000001,64235.739000000001,15329718.072000001,312893.71999999997,4.7E-2,2E-3,0.42599999999999999,8.9999999999999993E-3,0.49299999999999999,4076.4405998470938,8423.3431645371838,null,null,null,null,null,null,null,null,null,null,null,null,null,null,null,null,null,null,null,null,null,null,null,"MD",520.02200000000005,0.11600000000000001,0.17399999999999999,4076.4405998470938,null,null,null,null,null,null,null,null,null,null,null,null,null,null,"Maine","ME",null,null,null,"Maryland","Maryland","SPP South","SPP South"]
[null,null,"Natural Gas",null,null,null,{"$f":"E93","v":0},null,{"$f":"I93","v":90.935915472557525},null,{"$f":"K93","v":0},null,{"$f":"M93","v":0},null,{"$f":"O93","v":0},null,{"$f":"Q93","v":0},null,{"$f":"S93","v":0},null,null,22,"ME",5569,44334746.258000001,12512180.99,1957.95,1178.6089999999999,1950796.1270000001,0.313,0.188,311.82400000000001,8.7999999999999995E-2,7.2999999999999995E-2,5.2999999999999999E-2,88.003,0.14599999999999999,7.6999999999999999E-2,847.14400000000001,2.1000000000000001E-2,1.0999999999999999E-2,119.874,43205.055999999997,67115.763000000006,3975075.4169999999,179005.538,3.0000000000000001E-3,5.0000000000000001E-3,0.318,1.4E-2,0.45700000000000002,3543.3268023722858,10396.474958881301,null,null,null,null,null,null,null,null,null,null,null,null,null,null,null,null,null,null,null,null,null,null,null,"ME",311.82400000000001,0.188,0.313,3543.3268023722858,null,null,null,null,null,null,null,null,null,null,null,null,null,null,"Michigan","MI",null,null,null,"Maine","Maine","WECC California","WECC California"]
[null,null,"Propane",null,"MMBtu/yr",null,{"$f":"E122","v":0},null,{"$f":"I122","v":0},null,{"$f":"K122","v":0},null,{"$f":"M122","v":0},null,{"$f":"O122","v":0},null,{"$f":"Q122","v":0},null,{"$f":"S122","v":0},null,null,23,"MI",33247.1,692305003.51999998,120648501.215,34100.196000000004,26504.644,47847447.148000002,0.56499999999999995,0.439,793.17100000000005,9.9000000000000005E-2,9.2999999999999999E-2,7.6999999999999999E-2,138.226,0.8,0.63600000000000001,1181.8140000000001,9.7000000000000003E-2,7.6999999999999999E-2,142.90299999999999,23554514.598999999,1350492.007,54068082.071999997,1515185.71,0.19500000000000001,1.0999999999999999E-2,0.44800000000000001,1.2999999999999999E-2,0.68400000000000005,5738.1981255306882,8601.3150211506563,null,null,null,null,null,null,null,null,null,null,null,null,null,null,null,null,null,null,null,null,null,null,null,"MI",793.17100000000005,0.439,0.56499999999999995,5738.1981255306882,null,null,null,null,null,null,null,null,null,null,null,null,null,null,"Minnesota","MN",null,null,null,"Michigan","Michigan","WECC Northwest","WECC Northwest"]
[null,null,"Heating Oil",null,null,null,{"$f":"E126","v":0},null,{"$f":"I126","v":0},null,{"$f":"K126","v":0},null,{"$f":"M126","v":0},null,{"$f":"O126","v":0},null,{"$f":"Q126","v":0},null,{"$f":"S126","v":0},null,null,24,"MN",20346.099999999999,262470921.30500001,57260118.976999998,14205.842000000001,5342.3289999999997,21402253.182,0.496,0.187,747.54499999999996,0.108,0.106,4.1000000000000002E-2,163.083,0.88100000000000001,0.28199999999999997,1570.972,9.4E-2,0.03,168.42400000000001,12793785.489,54263.7,13823605.905999999,254926.78,0.223,1E-3,0.24099999999999999,4.0000000000000001E-3,0.49,4583.8347176754596,9747.6509466911302,null,null,null,null,null,null,null,null,null,null,null,null,null,null,null,null,null,null,null,null,null,null,null,"MN",747.54499999999996,0.187,0.496,4583.8347176754596,null,null,null,null,null,null,null,null,null,null,null,null,null,null,"Missouri","MO",null,null,null,"Minnesota","Minnesota","WECC Rockies","WECC Rockies"]
[null,null,"Total Energy Consumption",null,null,null,{"$f":"SUM(G30:G33)","v":117.79121434165873},null,{"$f":"SUM(I30:I33)","v":90.935915472557525},null,{"$f":"SUM(K30:K33)","v":0},null,{"$f":"SUM(M30:M33)","v":0},null,{"$f":"SUM(O30:O33)","v":0},null,{"$f":"SUM(Q30:Q33)","v":0},null,{"$f":"SUM(S30:S33)","v":0},null,null,25,"MO",23133.9,497548140.995,66705178.956,35312.682000000001,72692.688999999998,48165698.608000003,1.0589999999999999,2.1800000000000002,1444.1369999999999,0.14199999999999999,9.1999999999999998E-2,0.29199999999999998,193.61199999999999,1.4179999999999999,2.919,1934.34,0.14199999999999999,0.29199999999999998,193.81800000000001,40348167.980999999,131722.49799999999,9260975.3509999998,0,0.60499999999999998,2E-3,0.13900000000000001,0,0.747,7458.9132175657933,10002.804187114007,null,null,null,null,null,null,null,null,null,null,null,null,null,null,null,null,null,null,null,null,null,null,null,"MO",1444.1369999999999,2.1800000000000002,1.0589999999999999,7458.9132175657933,null,null,null,null,null,null,null,null,null,null,null,null,null,null,"Mississippi","MS",null,null,null,"Missouri","Missouri","WECC Southwest","WECC Southwest"]
[null,null,"CO2 Emissions",null,"lb/year",null,null,null,null,null,null,null,null,null,null,null,null,null,null,null,null,26,"MS",17031.599999999999,474122406.18099999,72933440.201000005,13338.087,4498.0029999999997,30133709.322000001,0.36599999999999999,0.123,826.33500000000004,5.6000000000000001E-2,6.0999999999999999E-2,1.9E-2,127.114,0.43099999999999999,9.5000000000000001E-2,1020.0549999999999,5.5E-2,1.2E-2,129.17099999999999,4036974.42,7060.3810000000003,55167572.317000002,0,5.5E-2,0,0.75600000000000001,0,0.83,6500.7547275207125,8007.254476916055,null,null,null,null,null,null,null,null,null,null,null,null,null,null,null,null,null,null,null,null,null,null,null,{"$f":"W36","v":"MT"},{"$f":"AF36","v":1056.1669999999999},{"$f":"AE36","v":0.80900000000000005},{"$f":"AD36","v":0.873},{"$f":"AZ36","v":5192.3894537011729},null,null,null,null,null,null,null,null,null,null,null,null,null,null,"Montana","MT",null,null,null,"Mississippi","Mississippi"]
[null,null,"Electricity",null,null,null,{"$f":"E115","v":17266.816256185801},null,{"$f":"I115","v":0},null,{"$f":"K115","v":0},null,{"$f":"M115","v":0},null,{"$f":"O115","v":0},null,{"$f":"Q115","v":0},null,{"$f":"S115","v":0},null,null,27,"MT",6890.3,139653250.25600001,26895758.013,11734.543,10875.186,14203204.304,0.873,0.80900000000000005,1056.1669999999999,0.16800000000000001,0.161,0.156,203.40700000000001,1.7949999999999999,1.6659999999999999,2175.8679999999999,0.16800000000000001,0.156,203.721,11553038.6,490846.62599999999,1001699.915,9622.5339999999997,0.43,1.7999999999999999E-2,3.6999999999999998E-2,0,0.48599999999999999,5192.3894537011729,10697.129737999363,null,null,null,null,null,null,null,null,null,null,null,null,null,null,null,null,null,null,null,null,null,null,null,"NC",623.95799999999997,0.16600000000000001,0.38600000000000001,4530.1236560618408,null,null,null,null,null,null,null,null,null,null,null,null,null,null,"North Carolina","NC",null,null,null,"Montana","Montana"]
[null,null,"Natural Gas",null,null,null,{"$f":"E119","v":0},null,{"$f":"I119","v":10698.342996771473},null,{"$f":"K119","v":0},null,{"$f":"M119","v":0},null,{"$f":"O119","v":0},null,{"$f":"Q119","v":0},null,{"$f":"S119","v":0},null,null,28,"NC",39154.9,573109024.59300005,126510680.08400001,24398.718000000001,10478.67,39468698.056999996,0.38600000000000001,0.16600000000000001,623.95799999999997,8.5000000000000006E-2,8.8999999999999996E-2,3.6999999999999998E-2,137.73500000000001,0.71299999999999997,0.26700000000000002,1194.4960000000001,8.4000000000000005E-2,3.2000000000000001E-2,141.303,14204598.859999999,84102.297999999995,51784571.578000002,0,0.112,1E-3,0.40899999999999997,0,0.53600000000000003,4530.1236560618408,8673.8404329220066,null,null,null,null,null,null,null,null,null,null,null,null,null,null,null,null,null,null,null,null,null,null,null,"ND",1288.364,1.603,1.3260000000000001,6105.2491414563729,null,null,null,null,null,null,null,null,null,null,null,null,null,null,"North Dakota","ND",null,null,null,"North Carolina","North Carolina"]
[null,null,"Propane",null,null,null,{"$f":"E123","v":0},null,{"$f":"I123","v":0},null,{"$f":"K123","v":0},null,{"$f":"M123","v":0},null,{"$f":"O123","v":0},null,{"$f":"Q123","v":0},null,{"$f":"S123","v":0},null,null,29,"ND",9875.2000000000007,256840548.58199999,42068807.125,27883.391,33709.341,27099969.919,1.3260000000000001,1.603,1288.364,0.217,0.216,0.26200000000000001,211.02600000000001,2.194,2.6539999999999999,2132.674,0.217,0.26300000000000001,211.09299999999999,22525075.524999999,53110.228000000003,2833420.6140000001,23420.763999999999,0.53500000000000003,1E-3,6.7000000000000004E-2,1E-3,0.60499999999999998,6105.2491414563729,10097.907395937662,null,null,null,null,null,null,null,null,null,null,null,null,null,null,null,null,null,null,null,null,null,null,null,"NE",1018.154,2.1190000000000002,0.95499999999999996,5065.0984246321177,null,null,null,null,null,null,null,null,null,null,null,null,null,null,"Nebraska","NE",null,null,null,"North Dakota","North Dakota"]
[null,null,"Heating Oil",null,null,null,{"$f":"E127","v":0},null,{"$f":"I127","v":0},null,{"$f":"K127","v":0},null,{"$f":"M127","v":0},null,{"$f":"O127","v":0},null,{"$f":"Q127","v":0},null,{"$f":"S127","v":0},null,null,30,"NE",11356.2,199797644.55899999,39445955.005999997,18829.620999999999,41789.504000000001,20081034.173999999,0.95499999999999996,2.1190000000000002,1018.154,0.188,0.192,0.41799999999999998,201.01400000000001,1.9059999999999999,4.3099999999999996,2071.3449999999998,0.186,0.42,201.77799999999999,17916482,35117.440999999999,1410845.68,0,0.45400000000000001,1E-3,3.5999999999999997E-2,0,0.49299999999999999,5065.0984246321177,10318.823026246035,null,null,null,null,null,null,null,null,null,null,null,null,null,null,null,null,null,null,null,null,null,null,null,"NH",272.85399999999998,5.2999999999999999E-2,0.13400000000000001,2777.6827901340616,null,null,null,null,null,null,null,null,null,null,null,null,null,null,"New Hampshire","NH",null,null,null,"Nebraska","Nebraska"]
[null,null,"Total CO2 Emissions",null,null,null,{"$f":"E130","v":17266.816256185801},null,{"$f":"I130","v":10698.342996771473},null,{"$f":"K130","v":0},null,{"$f":"M130","v":0},null,{"$f":"O130","v":0},null,{"$f":"Q130","v":0},null,{"$f":"S130","v":0},null,null,31,"NH",4732.3999999999996,46734509.858000003,16824998.888999999,1127.4680000000001,449.09399999999999,2295383.716,0.13400000000000001,5.2999999999999999E-2,272.85399999999998,4.8000000000000001E-2,3.5000000000000003E-2,1.9E-2,98.230999999999995,0.253,0.10299999999999999,929.24800000000005,3.4000000000000002E-2,1.4E-2,124.005,160140.26999999999,67959.205000000002,4225547.9189999998,51090.385000000002,0.01,4.0000000000000001E-3,0.251,3.0000000000000001E-3,0.314,2777.6827901340616,10374.523923648789,null,null,null,null,null,null,null,null,null,null,null,null,null,null,null,null,null,null,null,null,null,null,null,"NJ",468.31,5.8999999999999997E-2,0.16300000000000001,4020.1317891934477,null,null,null,null,null,null,null,null,null,null,null,null,null,null,"New Jersey","NJ",null,null,null,"New Hampshire","New Hampshire"]
[null,null,"SO2 Emissions",null,"lb/year",null,null,null,null,null,null,null,null,null,null,null,null,null,null,null,null,32,"NJ",18289.3,258072545.266,64195046.033,5217.2020000000002,1890.376,15031580.67,0.16300000000000001,5.8999999999999997E-2,468.31,0.04,3.7999999999999999E-2,1.4999999999999999E-2,116.491,0.19400000000000001,6.0000000000000001E-3,837.90899999999999,2.7E-2,1E-3,117.965,0,42265.62,33045872.294,705532.53500000003,0,1E-3,0.51500000000000001,1.0999999999999999E-2,0.53700000000000003,4020.1317891934477,7636.712491928698,null,null,null,null,null,null,null,null,null,null,null,null,null,null,null,null,null,null,null,null,null,null,null,"NM",770.21400000000006,0.105,0.39400000000000002,5059.9406656267311,null,null,null,null,null,null,null,null,null,null,null,null,null,null,"New Mexico","NM",null,null,null,"New Jersey","New Jersey"]
[null,null,"Electricity",null,null,null,{"$f":"E116","v":7.7073138763491134},null,{"$f":"I116","v":0},null,{"$f":"K116","v":0},null,{"$f":"M116","v":0},null,{"$f":"O116","v":0},null,{"$f":"Q116","v":0},null,{"$f":"S116","v":0},null,null,33,"NM",11346,198647495.94100001,39258858.762999997,7727.3729999999996,2068.81,15118858.605,0.39400000000000002,0.105,770.21400000000006,7.8E-2,7.4999999999999997E-2,2.1000000000000001E-2,152.21799999999999,0.67500000000000004,0.192,1399.692,7.2999999999999995E-2,2.1000000000000001E-2,152.339,7371813.2999999998,1411.085,14230764.755000001,0,0.188,0,0.36199999999999999,0,0.55100000000000005,5059.9406656267311,9194.945185988925,null,null,null,null,null,null,null,null,null,null,null,null,null,null,null,null,null,null,null,null,null,null,null,"NV",642.37,0.13700000000000001,0.47899999999999998,4975.5868464314153,null,null,null,null,null,null,null,null,null,null,null,null,null,null,"Nevada","NV",null,null,null,"New Mexico","New Mexico"]
[null,null,"Natural Gas",null,null,null,{"$f":"E120","v":0},null,{"$f":"I120","v":5.3491714983857366E-2},null,{"$f":"K120","v":0},null,{"$f":"M120","v":0},null,{"$f":"O120","v":0},null,{"$f":"Q120","v":0},null,{"$f":"S120","v":0},null,null,34,"NV",16023.5,209782461.31099999,42162355.473999999,10091.102999999999,2890.027,13541908.809,0.47899999999999998,0.13700000000000001,642.37,9.6000000000000002E-2,0.11,2.8000000000000001E-2,129.10400000000001,0.754,0.215,1009.955,9.7000000000000003E-2,2.8000000000000001E-2,129.279,2059635.61,7892.4319999999998,24599326.477000002,0,4.9000000000000002E-2,0,0.58299999999999996,0,0.63400000000000001,4975.5868464314153,7866.786881877315,null,null,null,null,null,null,null,null,null,null,null,null,null,null,null,null,null,null,null,null,null,null,null,"NY",465.13600000000002,5.0999999999999997E-2,0.183,4042.2495609216826,null,null,null,null,null,null,null,null,null,null,null,null,null,null,"New York","NY",null,null,null,"Nevada","Nevada"]
[null,null,"Propane",null,null,null,{"$f":"E124","v":0},null,{"$f":"I124","v":0},null,{"$f":"K124","v":0},null,{"$f":"M124","v":0},null,{"$f":"O124","v":0},null,{"$f":"Q124","v":0},null,{"$f":"S124","v":0},null,null,35,"NY",43557.9,499111591.08999997,123473720.15700001,11326.044,3166.1669999999999,28716017.307,0.183,5.0999999999999997E-2,465.13600000000002,4.4999999999999998E-2,4.3999999999999997E-2,1.2999999999999999E-2,115.069,0.27200000000000002,2.5999999999999999E-2,933.79200000000003,3.4000000000000002E-2,3.0000000000000001E-3,117.777,0,412022.01500000001,57947314.935999997,963374.62100000004,0,3.0000000000000001E-3,0.46899999999999997,8.0000000000000002E-3,0.49399999999999999,4042.2495609216826,8413.4992798538551,null,null,null,null,null,null,null,null,null,null,null,null,null,null,null,null,null,null,null,null,null,null,null,"OH",1063.8430000000001,0.61,0.34399999999999997,7054.5368357456136,null,null,null,null,null,null,null,null,null,null,null,null,null,null,"Ohio","OH",null,null,null,"New York","New York"]
[null,null,"Heating Oil",null,null,null,{"$f":"E128","v":0},null,{"$f":"I128","v":0},null,{"$f":"K128","v":0},null,{"$f":"M128","v":0},null,{"$f":"O128","v":0},null,{"$f":"Q128","v":0},null,{"$f":"S128","v":0},null,null,36,"OH",33503.5,939107638.76199996,133121090.814,22890.447,40604.292000000001,70809976.726999998,0.34399999999999997,0.61,1063.8430000000001,4.9000000000000002E-2,3.5999999999999997E-2,8.5999999999999993E-2,150.803,0.40300000000000002,0.72499999999999998,1261.2280000000001,4.8000000000000001E-2,8.6999999999999994E-2,150.74100000000001,31363276.285,1049331.57,78692836.791999996,795657.93200000003,0.23599999999999999,8.0000000000000002E-3,0.59099999999999997,6.0000000000000001E-3,0.84299999999999997,7054.5368357456136,8392.3001393038849,null,null,null,null,null,null,null,null,null,null,null,null,null,null,null,null,null,null,null,null,null,null,null,"OK",647.20699999999999,0.221,0.46899999999999997,5014.7712775524242,null,null,null,null,null,null,null,null,null,null,null,null,null,null,"Oklahoma","OK",null,null,null,"Ohio","Ohio"]
[null,null,"Total SO2 Emissions",null,null,null,{"$f":"E131","v":7.7073138763491134},null,{"$f":"I131","v":5.3491714983857366E-2},null,{"$f":"K131","v":0},null,{"$f":"M131","v":0},null,{"$f":"O131","v":0},null,{"$f":"Q131","v":0},null,{"$f":"S131","v":0},null,null,37,"OK",33980.400000000001,445703422.71799999,88878115.879999995,20863.357,9813.3019999999997,28761252.734999999,0.46899999999999997,0.221,647.20699999999999,9.4E-2,0.10199999999999999,4.3999999999999997E-2,129.06,0.82899999999999996,0.378,1150.2249999999999,9.2999999999999999E-2,4.2999999999999997E-2,129.673,5061859.0729999999,19727.440999999999,44991794.847999997,18472.083999999999,5.7000000000000002E-2,0,0.50600000000000001,0,0.56699999999999995,5014.7712775524242,8897.7227244840724,null,null,null,null,null,null,null,null,null,null,null,null,null,null,null,null,null,null,null,null,null,null,null,"OR",364.16199999999998,0.02,0.63900000000000001,3221.8683848321298,null,null,null,null,null,null,null,null,null,null,null,null,null,null,"Oregon","OR",null,null,null,"Oklahoma","Oklahoma"]
[null,null,"NOX Emissions",null,"lb/year",null,null,null,null,null,null,null,null,null,null,null,null,null,null,null,null,38,"OR",18220.900000000001,198735474.18399999,61683300.012999997,19715.185000000001,622.79899999999998,11231359.308,0.63900000000000001,0.02,364.16199999999998,0.19800000000000001,0.19800000000000001,6.0000000000000001E-3,113.02800000000001,1.5940000000000001,6.0000000000000001E-3,956.36400000000003,0.19700000000000001,1E-3,118.405,0,195.02,23384819.657000002,26841.728999999999,0,0,0.379,0,0.39500000000000002,3221.8683848321298,8488.6679098658751,null,null,null,null,null,null,null,null,null,null,null,null,null,null,null,null,null,null,null,null,null,null,null,"PA",645.77300000000002,0.22900000000000001,0.20499999999999999,5078.8732985919842,null,null,null,null,null,null,null,null,null,null,null,null,null,null,"Pennsylvania","PA",null,null,null,"Oregon","Oregon"]
[null,null,"Electricity",null,null,null,{"$f":"E117","v":9.6511337781443931},null,{"$f":"I117","v":0},null,{"$f":"K117","v":0},null,{"$f":"M117","v":0},null,{"$f":"O117","v":0},null,{"$f":"Q117","v":0},null,{"$f":"S117","v":0},null,null,39,"PA",53762,1198169953.461,235912550.48500001,24158.065999999999,26965.077000000001,76172924.030000001,0.20499999999999999,0.22900000000000001,645.77300000000002,0.04,3.7999999999999999E-2,4.4999999999999998E-2,127.149,0.27100000000000002,0.315,979.62599999999998,3.5999999999999997E-2,4.1000000000000002E-2,128.72499999999999,12834827.965,48121.495000000003,139252157.19,1472335.62,5.3999999999999999E-2,0,0.59,6.0000000000000001E-3,0.65800000000000003,5078.8732985919842,7800.2076966749028,null,null,null,null,null,null,null,null,null,null,null,null,null,null,null,null,null,null,null,null,null,null,null,"RI",839.13599999999997,1.2999999999999999E-2,0.372,7285.8974597716651,null,null,null,null,null,null,null,null,null,null,null,null,null,null,"Rhode Island","RI",null,null,null,"Pennsylvania","Pennsylvania"]
[null,null,"Natural Gas",null,null,null,{"$f":"E121","v":0},null,{"$f":"I121","v":11.223354273464889},null,{"$f":"K121","v":0},null,{"$f":"M121","v":0},null,{"$f":"O121","v":0},null,{"$f":"Q121","v":0},null,{"$f":"S121","v":0},null,null,40,"RI",2472.6,75893937.392000005,10416553.048,1939.3219999999999,65.275999999999996,4370451.4419999998,0.372,1.2999999999999999E-2,839.13599999999997,5.0999999999999997E-2,5.1999999999999998E-2,2E-3,115.173,0.40500000000000003,5.0000000000000001E-3,912.80200000000002,5.2999999999999999E-2,1E-3,118.916,0,30248.519,9545650.7249999996,0,0,3.0000000000000001E-3,0.91600000000000004,0,0.94199999999999995,7285.8974597716651,7925.5154485416188,null,null,null,null,null,null,null,null,null,null,null,null,null,null,null,null,null,null,null,null,null,null,null,"SC",557.173,0.17100000000000001,0.23799999999999999,3647.4376479792882,null,null,null,null,null,null,null,null,null,null,null,null,null,null,"South Carolina","SC",null,null,null,"Rhode Island","Rhode Island"]
[null,null,"Propane",null,null,null,{"$f":"E125","v":0},null,{"$f":"I125","v":0},null,{"$f":"K125","v":0},null,{"$f":"M125","v":0},null,{"$f":"O125","v":0},null,{"$f":"Q125","v":0},null,{"$f":"S125","v":0},null,null,41,"SC",26563.599999999999,367856442.12900001,100853387.40000001,12004.016,8624.6080000000002,28096403.535999998,0.23799999999999999,0.17100000000000001,557.173,6.5000000000000002E-2,6.7000000000000004E-2,4.7E-2,152.75700000000001,0.56299999999999994,0.38400000000000001,1444.126,6.2E-2,4.2000000000000003E-2,158.667,15150420.790999999,96064.084000000003,23691443.866999999,44685.38,0.15,1E-3,0.23499999999999999,0,0.40400000000000003,3647.4376479792882,9436.423144372935,null,null,null,null,null,null,null,null,null,null,null,null,null,null,null,null,null,null,null,null,null,null,null,"SD",334.03199999999998,7.5999999999999998E-2,0.25,2086.6436835943832,null,null,null,null,null,null,null,null,null,null,null,null,null,null,"South Dakota","SD",null,null,null,"South Carolina","South Carolina"]
[null,null,"Heating Oil",null,null,null,{"$f":"E129","v":0},null,{"$f":"I129","v":0},null,{"$f":"K129","v":0},null,{"$f":"M129","v":0},null,{"$f":"O129","v":0},null,{"$f":"Q129","v":0},null,{"$f":"S129","v":0},null,null,42,"SD",7235.5,36320110.620999999,17405995.526000001,2173.5680000000002,660.09500000000003,2907080.4679999999,0.25,7.5999999999999998E-2,334.03199999999998,0.12,0.11899999999999999,3.5999999999999997E-2,160.08099999999999,1.169,0.35499999999999998,1563.701,0.12,3.5999999999999997E-2,160.08099999999999,1562742.1,23041.409,2115780.2510000002,0,0.09,1E-3,0.122,0,0.214,2086.6436835943832,9812.0991494146238,null,null,null,null,null,null,null,null,null,null,null,null,null,null,null,null,null,null,null,null,null,null,null,"TN",657.26700000000005,0.21299999999999999,0.23699999999999999,3902.3024090339727,null,null,null,null,null,null,null,null,null,null,null,null,null,null,"Tennessee","TN",null,null,null,"South Dakota","South Dakota"]
[null,null,"Total NOX Emissions",null,null,null,{"$f":"E132","v":9.6511337781443931},null,{"$f":"I132","v":11.223354273464889},null,{"$f":"K132","v":0},null,{"$f":"M132","v":0},null,{"$f":"O132","v":0},null,{"$f":"Q132","v":0},null,{"$f":"S132","v":0},null,null,43,"TN",24375.1,303419648.07499999,77754006.806999996,9225.5480000000007,8285.4419999999991,25552566.613000002,0.23699999999999999,0.21299999999999999,657.26700000000005,6.0999999999999999E-2,5.8000000000000003E-2,5.5E-2,168.43100000000001,0.55500000000000005,0.52400000000000002,1704.73,5.6000000000000001E-2,5.2999999999999999E-2,172.935,15792908.671,101670.94500000001,14993149.636,10846.629000000001,0.20300000000000001,1E-3,0.193,0,0.40300000000000002,3902.3024090339727,9819.8586641521324,null,null,null,null,null,null,null,null,null,null,null,null,null,null,null,null,null,null,null,null,null,null,null,"TX",768.31700000000001,0.38900000000000001,0.47599999999999998,5376.1736583265019,null,null,null,null,null,null,null,null,null,null,null,null,null,null,"Texas","TX",null,null,null,"Tennessee","Tennessee"]
[null,null,"Emissions Savings (relative to Reference Case)",null,null,null,null,null,null,null,null,null,null,null,null,null,null,null,null,null,null,44,"TX",166741.20000000001,2924846243.1560001,544038647.00800002,129439.519,105797.409,208997061.398,0.47599999999999998,0.38900000000000001,768.31700000000001,8.8999999999999996E-2,8.7999999999999995E-2,7.1999999999999995E-2,142.911,0.73,0.59899999999999998,1186.826,8.7999999999999995E-2,7.2999999999999995E-2,143.63399999999999,70692781.819999993,232193.33900000001,281027742.97899997,2329379.1510000001,0.13,0,0.51700000000000002,4.0000000000000001E-3,0.65400000000000003,5376.1736583265019,8255.6986806197638,null,null,null,null,null,null,null,null,null,null,null,null,null,null,null,null,null,null,null,null,null,null,null,"UT",1413.019,0.27500000000000002,1.282,8106.1423926717443,null,null,null,null,null,null,null,null,null,null,null,null,null,null,"Utah","UT",null,null,null,"Texas","Texas"]
[null,null,"CO2",null,"lb/year",null,"N/A",null,{"$f":"I133","v":6568.4732594143279},null,{"$f":"K133","v":0},null,{"$f":"M133","v":0},null,{"$f":"O133","v":0},null,{"$f":"Q133","v":0},null,{"$f":"S133","v":0},null,null,45,"UT",10132.4,265795869.92399999,32789440.037999999,21019.628000000001,4515.8440000000001,23166056.111000001,1.282,0.27500000000000002,1413.019,0.158,0.14899999999999999,3.4000000000000002E-2,174.315,1.57,0.33600000000000002,1730.799,0.159,3.4000000000000002E-2,175.023,14894151.646,28250.181,11834246.622,2746.502,0.45400000000000001,1E-3,0.36099999999999999,0,0.81899999999999995,8106.1423926717443,9932.8056710814071,null,null,null,null,null,null,null,null,null,null,null,null,null,null,null,null,null,null,null,null,null,null,null,"VA",536.851,7.0999999999999994E-2,0.17499999999999999,4795.8482861974953,null,null,null,null,null,null,null,null,null,null,null,null,null,null,"Virginia","VA",null,null,null,"Utah","Utah"]
[null,null,null,null,null,null,null,null,{"$f":"I54/$G40","v":0.38041021355405841},null,{"$f":"K54/$G40","v":0},null,{"$f":"M54/$G40","v":0},null,{"$f":"O54/$G40","v":0},null,{"$f":"Q54/$G40","v":0},null,{"$f":"S54/$G40","v":0},null,null,46,"VA",31740.2,436537790.47100002,91024103.437000006,7981.91,3211.614,24433203.526000001,0.17499999999999999,7.0999999999999994E-2,536.851,3.6999999999999998E-2,3.9E-2,1.4999999999999999E-2,111.941,0.214,4.3999999999999997E-2,897.95399999999995,2.9000000000000001E-2,6.0000000000000001E-3,120.294,1415026.912,134545.48000000001,50604693.836999997,478300.49900000001,1.6E-2,1E-3,0.55600000000000005,5.0000000000000001E-3,0.61499999999999999,4795.8482861974953,8294.0623573800822,null,null,null,null,null,null,null,null,null,null,null,null,null,null,null,null,null,null,null,null,null,null,null,"VT",42.981000000000002,3.9E-2,0.16800000000000001,2529.4295941356672,null,null,null,null,null,null,null,null,null,null,null,null,null,null,"Vermont","VT",null,null,null,"Virginia","Virginia"]
[null,null,"SO2",null,null,null,"N/A",null,{"$f":"I134","v":7.6538221613652562},null,{"$f":"K134","v":0},null,{"$f":"M134","v":0},null,{"$f":"O134","v":0},null,{"$f":"Q134","v":0},null,{"$f":"S134","v":0},null,null,47,"VT",906.1,6273488.1100000003,2480198.747,208.49700000000001,48.197000000000003,53300.218999999997,0.16800000000000001,3.9E-2,42.981000000000002,6.6000000000000003E-2,6.5000000000000002E-2,1.4999999999999999E-2,16.992000000000001,8.4540000000000006,4.9480000000000004,3308.1320000000001,0.41599999999999998,0.24299999999999999,162.59,0,2610.6390000000001,1263.702,0,0,1E-3,1E-3,0,0.16400000000000001,2529.4295941356672,1619240.0488237869,null,null,null,null,null,null,null,null,null,null,null,null,null,null,null,null,null,null,null,null,null,null,null,"WA",265.11900000000003,4.3999999999999997E-2,0.18099999999999999,1995.3436368184684,null,null,null,null,null,null,null,null,null,null,null,null,null,null,"Washington","WA",null,null,null,"Vermont","Vermont"]
[null,null,null,null,null,null,null,null,{"$f":"I56/$G46","v":0.99305961637970874},null,{"$f":"K56/$G46","v":0},null,{"$f":"M56/$G46","v":0},null,{"$f":"O56/$G46","v":0},null,{"$f":"Q56/$G46","v":0},null,{"$f":"S56/$G46","v":0},null,null,48,"WA",31522.3,205426913.13600001,102953150.197,9337.5139999999992,2247.6860000000001,13647438.613,0.18099999999999999,4.3999999999999997E-2,265.11900000000003,9.0999999999999998E-2,0.09,2.1999999999999999E-2,132.869,0.66500000000000004,0.106,1134.4549999999999,8.3000000000000004E-2,1.2999999999999999E-2,141.34899999999999,4162607.2650000001,23717.440999999999,19407850.618000001,306925.04200000002,0.04,0,0.189,3.0000000000000001E-3,0.24399999999999999,1995.3436368184684,8594.8726205185794,null,null,null,null,null,null,null,null,null,null,null,null,null,null,null,null,null,null,null,null,null,null,null,"WI",1156.9960000000001,0.14399999999999999,0.50800000000000001,7228.396754037386,null,null,null,null,null,null,null,null,null,null,null,null,null,null,"Wisconsin","WI",null,null,null,"Washington","Washington"]
[null,null,"NOX",null,null,null,"N/A",null,{"$f":"I135","v":-1.5722204953204955},null,{"$f":"K135","v":0},null,{"$f":"M135","v":0},null,{"$f":"O135","v":0},null,{"$f":"Q135","v":0},null,{"$f":"S135","v":0},null,null,49,"WI",19253.900000000001,452056004.704,62538903.174000002,15900.210999999999,4517.7929999999997,36178632.494000003,0.50800000000000001,0.14399999999999999,1156.9960000000001,7.0000000000000007E-2,7.1999999999999995E-2,0.02,160.06299999999999,0.626,0.159,1539.845,6.7000000000000004E-2,1.7000000000000001E-2,163.751,21086690.443,91090.97,25621193.982000001,95460.042000000001,0.33700000000000002,1E-3,0.41,2E-3,0.76600000000000001,7228.396754037386,9639.8645274514802,null,null,null,null,null,null,null,null,null,null,null,null,null,null,null,null,null,null,null,null,null,null,null,"WV",1954.383,1.498,1.0620000000000001,9840.3970857296099,null,null,null,null,null,null,null,null,null,null,null,null,null,null,"West Virginia","WV",null,null,null,"Wisconsin","Wisconsin"]
[null,null,null,null,null,null,null,null,{"$f":"I58/$G52","v":-0.16290526392669935},null,{"$f":"K58/$G52","v":0},null,{"$f":"M58/$G52","v":0},null,{"$f":"O58/$G52","v":0},null,{"$f":"Q58/$G52","v":0},null,{"$f":"S58/$G52","v":0},null,null,50,"WV",15699.4,514522719.53299999,52286784.267999999,27758.075000000001,39162.372000000003,51094198.799000002,1.0620000000000001,1.498,1954.383,0.108,9.4E-2,0.152,198.608,1.141,1.609,2099.5309999999999,0.108,0.152,198.624,44797569.289999999,162826.02499999999,3679657.7250000001,31967.937000000002,0.85699999999999998,3.0000000000000001E-3,7.0000000000000007E-2,1E-3,0.93100000000000005,9840.3970857296099,10571.221601341316,null,null,null,null,null,null,null,null,null,null,null,null,null,null,null,null,null,null,null,null,null,null,null,"WY",1820.318,1.113,1.202,8881.9347876375177,null,null,null,null,null,null,null,null,null,null,null,null,null,null,"Wyoming","WY",null,null,null,"West Virginia","West Virginia"]
[null,null,"Equivalent CO2 Emissions ",null,null,null,null,null,null,null,null,null,null,null,null,null,null,null,null,null,null,51,"WY",11105,383489535.84200001,43176351.213,25944.44,24027.186000000002,39297340.119999997,1.202,1.113,1820.318,0.13500000000000001,0.13,0.125,204.946,1.554,1.4410000000000001,2354.4009999999998,0.13500000000000001,0.125,204.80799999999999,30844003.170000002,43711.743000000002,2129478.1949999998,352365.76,0.71399999999999997,1E-3,4.9000000000000002E-2,8.0000000000000002E-3,0.77300000000000002,8881.9347876375177,11492.196746111327,null,null,null,null,null,null,null,null,null,null,null,null,null,null,null,null,null,null,null,null,null,null,null,null,null,null,null,null,null,null,null,null,null,null,null,null,null,null,null,null,null,null,"ASCC Alaska Grid","ASCC Alaska Grid",null,null,null,"Wyoming","Wyoming"]
[null,null,"Cars",null,null,null,"N/A",null,{"$f":"I137","v":0.647704331596615},null,{"$f":"K137","v":0},null,{"$f":"M137","v":0},null,{"$f":"O137","v":0},null,{"$f":"Q137","v":0},null,{"$f":"S137","v":0},null,null,52,"ASCC Alaska Grid",2194,34476388.973999999,5096872.7790000001,14153.800999999999,789.81100000000004,2292658.4569999999,5.5540000000000003,0.31,899.63300000000004,0.82099999999999995,0.91400000000000003,4.5999999999999999E-2,132.999,6.6310000000000002,0.36699999999999999,1074.068,0.83099999999999996,4.5999999999999999E-2,134.57599999999999,730681.46,459495.57400000002,3080066.4739999999,0,0.14299999999999999,0.09,0.60399999999999998,0,0.84499999999999997,6764.2239602386589,8073.6353581267495,null,null,null,null,null,null,null,null,null,null,null,null,null,null,null,null,null,null,null,null,null,null,null,"US Average_Fossil",{"$f":"AM9","v":1270.259},{"$f":"AL9","v":0.56699999999999995},{"$f":"AK9","v":0.71},{"$f":"BA9","v":8665.4857455159454},null,null,null,null,null,null,null,null,null,null,null,null,null,null,"ASCC Miscellaneous","ASCC Miscellaneous"]
[null,null,"Homes",null,null,null,"N/A",null,{"$f":"I138","v":0.62097539085961417},null,{"$f":"K138","v":0},null,{"$f":"M138","v":0},null,{"$f":"O138","v":0},null,{"$f":"Q138","v":0},null,{"$f":"S138","v":0},null,null,53,"ASCC Miscellaneous",901.5,5457534.7680000002,1582032.382,6438.18,560.16800000000001,411710.53,8.1389999999999993,0.70799999999999996,520.48299999999995,2.359,2.25,0.20499999999999999,150.87799999999999,25.853999999999999,2.2549999999999999,1656.6659999999999,2.3530000000000002,0.20499999999999999,150.74799999999999,0,389096.75099999999,102340.629,0,0,0.246,6.5000000000000002E-2,0,0.311,3449.6985207727562,11105.249600671403,null,null,null,null,null,null,null,null,null,null,null,null,null,null,null,null,null,null,null,null,null,null,null,"AK_Fossil",1134.6969999999999,0.56299999999999994,8.6310000000000002,8386.5182655642075,null,null,null,null,null,null,null,null,null,null,null,null,null,null,"WECC Southwest","WECC Southwest"]
[null,null,"$ amount",null,null,null,{"$f":"SUM(Calc!B132:B135)","v":2059.6335071330118},null,{"$f":"Calc!B131","v":1348.5796264580281},null,null,null,null,null,null,null,null,null,null,null,null,54,"WECC Southwest",54243.199999999997,885385351.95599997,175554659.51899999,31618.223000000002,9001.44,61769179.174999997,0.36,0.10299999999999999,703.70299999999997,7.0999999999999994E-2,7.2999999999999995E-2,0.02,139.53100000000001,0.58699999999999997,0.16900000000000001,1173.527,7.0000000000000007E-2,0.02,140.494,19440366.670000002,34236.082000000002,85450236.460999995,0,0.111,0,0.48699999999999999,0,0.6,5043.3600246319647,8438.2817128615843,null,null,null,null,null,null,null,null,null,null,null,null,null,null,null,null,null,null,null,null,null,null,null,"AL_Fossil",1232.6890000000001,5.7000000000000002E-2,0.33100000000000002,8546.6504330002917,null,null,null,null,null,null,null,null,null,null,null,null,null,null,"WECC California","WECC California"]
[null,null,null,null,null,null,null,null,null,null,null,null,null,null,null,null,null,null,null,null,null,55,"WECC California",99264.3,818268630.176,220986983.331,36695.116000000002,2159.7910000000002,47342486.546999998,0.33200000000000002,0.02,428.464,0.09,9.1999999999999998E-2,5.0000000000000001E-3,115.714,0.60299999999999998,2.4E-2,931.57600000000002,0.08,3.0000000000000001E-3,123.822,4645646.3760000002,84833.379000000001,94784061.273000002,1483673.1740000001,2.1000000000000001E-2,0,0.42899999999999999,7.0000000000000001E-3,0.47899999999999998,3702.7910777458605,8101.8128552197359,null,null,null,null,null,null,null,null,null,null,null,null,null,null,null,null,null,null,null,null,null,null,null,"AR_Fossil",1450.0160000000001,1.2010000000000001,0.68500000000000005,8939.3114132665778,null,null,null,null,null,null,null,null,null,null,null,null,null,null,"ERCOT All","ERCOT All"]
[null,null,"Assumptions and Data Sources",null,null,null,null,null,null,null,null,null,null,null,null,null,null,null,null,null,null,56,"ERCOT All",145507.70000000001,2441458265.322,477137386.10100001,105681.056,76095.39,175076531.801,0.443,0.31900000000000001,733.86199999999997,8.6999999999999994E-2,8.5999999999999993E-2,6.2E-2,143.41999999999999,0.71299999999999997,0.51200000000000001,1176.912,8.6999999999999994E-2,6.3E-2,144.06700000000001,60420147.399999999,213046.005,236892782.76100001,1696010.173,0.127,0,0.496,4.0000000000000001E-3,0.629,5116.8873713140438,8159.3545153329042,null,null,null,null,null,null,null,null,null,null,null,null,null,null,null,null,null,null,null,null,null,null,null,"AZ_Fossil",1182.5809999999999,0.215,0.503,8386.1855283811528,null,null,null,null,null,null,null,null,null,null,null,null,null,null,"FRCC All","FRCC All"]
[null,null,null,null,null,null,null,null,null,null,null,null,null,null,null,null,null,null,null,null,null,57,"FRCC All",72773.8,1561123659.8599999,250055523.98300001,30262.333999999999,15974.794,97804509.085999995,0.24199999999999999,0.128,782.26199999999994,3.9E-2,3.7999999999999999E-2,0.02,125.3,0.215,0.11,945.99900000000002,2.9000000000000001E-2,1.4999999999999999E-2,127.009,11373250.602,1197480.0449999999,188752739.02599999,1459608.7930000001,4.4999999999999998E-2,5.0000000000000001E-3,0.755,6.0000000000000001E-3,0.82199999999999995,6243.1080705344975,7698.4907797508786,null,null,null,null,null,null,null,null,null,null,null,null,null,null,null,null,null,null,null,null,null,null,null,"CA_Fossil",873.41,7.0000000000000001E-3,0.52300000000000002,8043.2807549692297,null,null,null,null,null,null,null,null,null,null,null,null,null,null,"HICC Miscellaneous","HICC Miscellaneous"]
[null,null,"Description",null,"Value","Units",null,null,"Source",null,null,null,"Link",null,null,null,null,null,null,null,null,58,"HICC Miscellaneous",1099.2,19260745.5,2611612.997,9878.5969999999998,5862.0330000000004,1466905.3759999999,7.5650000000000004,4.4889999999999999,1123.3710000000001,1.026,1.0149999999999999,0.60899999999999999,152.321,10.903,6.4909999999999997,1617.308,1.0640000000000001,0.63300000000000001,157.75899999999999,0,1721735.6510000001,0,0,0,0.65900000000000003,0,0,0.70699999999999996,7375.0381553948137,11186.819236050076,null,null,null,null,null,null,null,null,null,null,null,null,null,null,null,null,null,null,null,null,null,null,null,"CO_Fossil",1732.3340000000001,0.55900000000000005,0.86,10110.044110409362,null,null,null,null,null,null,null,null,null,null,null,null,null,null,"HICC Oahu","HICC Oahu"]
[null,null,"Average gross (higher) heating value of natural gas",null,1020,"Btu/scf",null,null,"U.S. Environmental Protection Agency, AP 42, Fifth Edition, Volume I. Chapter 1: External Combustion Sources, Section 4. Natural Gas Combustion, Final Section, Section 1.4.1.",null,null,null,"http://www.epa.gov/ttn/chief/ap42/ch01/final/c01s04.pdf",null,null,null,null,null,null,null,null,59,"HICC Oahu",2352,61965314.321999997,6547004.7359999996,12792.987999999999,14009.869000000001,4876037.8449999997,3.9079999999999999,4.28,1489.548,0.41299999999999998,0.40300000000000002,0.45200000000000001,157.38,4.3890000000000002,4.9710000000000001,1661.123,0.43099999999999999,0.48899999999999999,163.29499999999999,0,5437720.7779999999,0,177774.96,0,0.83099999999999996,0,2.7E-2,0.88300000000000001,9464.6814567387537,11034.700623612154,null,null,null,null,null,null,null,null,null,null,null,null,null,null,null,null,null,null,null,null,null,null,null,"CT_Fossil",810.03,1.7999999999999999E-2,0.16600000000000001,7424.2903011025137,null,null,null,null,null,null,null,null,null,null,null,null,null,null,"MRO East","MRO East"]
[null,null,"Natural Gas CO2 Emission Factor",null,120000,"lb/106 scf",null,null,"U.S. Environmental Protection Agency, AP 42, Fifth Edition, Volume I. Chapter 1: External Combustion Sources, Section 4. Natural Gas Combustion, Final Section. Table 1.4-2",null,null,null,"http://www.epa.gov/ttn/chief/ap42/ch01/final/c01s04.pdf",null,null,null,null,null,null,null,null,60,"MRO East",9637.9,215861791.514,24520967.706,12037.444,3392.3110000000001,17131736.787999999,0.98199999999999998,0.27700000000000002,1397.3130000000001,0.112,0.11,3.1E-2,158.72900000000001,1.139,0.27800000000000002,1664.682,0.11,2.7E-2,160.51499999999999,9677002.2259999998,73857.732000000004,10519939.187999999,0,0.39500000000000002,3.0000000000000001E-3,0.42899999999999999,0,0.85699999999999998,8803.1514131956992,10648.903871981567,null,null,null,null,null,null,null,null,null,null,null,null,null,null,null,null,null,null,null,null,null,null,null,"DC_Fossil",758.14499999999998,2.1000000000000001E-2,2.6579999999999999,16693.59897498817,null,null,null,null,null,null,null,null,null,null,null,null,null,null,"MRO West","MRO West"]
[null,null,"Natural Gas SO2 Emission Factor",null,0.6,"lb/106 scf",null,null,"U.S. Environmental Protection Agency, AP 42, Fifth Edition, Volume I. Chapter 1: External Combustion Sources, Section 4. Natural Gas Combustion, Final Section. Table 1.4-2",null,null,null,"http://www.epa.gov/ttn/chief/ap42/ch01/final/c01s04.pdf",null,null,null,null,null,null,null,null,61,"MRO West",77431.600000000006,1175173096.497,240934538.66299999,85634.380999999994,107898.24400000001,110845559.8,0.71099999999999997,0.89600000000000002,920.13,0.14599999999999999,0.14299999999999999,0.184,188.64599999999999,1.411,1.8220000000000001,1891.086,0.14299999999999999,0.184,191.06399999999999,84747620.531000003,275003.19699999999,31533282.089000002,373807.58600000001,0.35199999999999998,1E-3,0.13100000000000001,2E-3,0.49199999999999999,4877.561776814151,10050.252089875123,null,null,null,null,null,null,null,null,null,null,null,null,null,null,null,null,null,null,null,null,null,null,null,"DE_Fossil",984.53700000000003,9.8000000000000004E-2,0.316,6305.1149529076038,null,null,null,null,null,null,null,null,null,null,null,null,null,null,"NPCC New England","NPCC New England"]
[null,null,"Natural Gas NOX Emission Factor",null,{"$f":"AVERAGE(CH9:CH17)","v":125.88888888888889},"lb/106 scf",null,null,"U.S. Environmental Protection Agency, AP 42, Fifth Edition, Volume I. Chapter 1: External Combustion Sources, Section 4. Natural Gas Combustion, Background Document, Table 3.4-1.",null,null,null,"http://www.epa.gov/ttn/chief/ap42/ch01/bgdocs/b01s04.pdf",null,null,null,null,null,null,null,null,62,"NPCC New England",39269.4,502359372.46399999,102716862.75,14961.040999999999,5936.8190000000004,27696321.951000001,0.29099999999999998,0.11600000000000001,539.27499999999998,0.06,5.5E-2,2.4E-2,110.265,0.22700000000000001,2.5999999999999999E-2,852.01099999999997,3.2000000000000001E-2,4.0000000000000001E-3,119.10599999999999,203345.326,389733.11200000002,57465432.703000002,1594279.338,2E-3,4.0000000000000001E-3,0.55900000000000005,1.6E-2,0.623,4890.7195860009851,8421.3893169146741,null,null,null,null,null,null,null,null,null,null,null,null,null,null,null,null,null,null,null,null,null,null,null,"FL_Fossil",949.63699999999994,0.107,0.23200000000000001,7746.2676596359624,null,null,null,null,null,null,null,null,null,null,null,null,null,null,"WECC Northwest","WECC Northwest"]
[null,null,"Propane Heat Content",null,91.5,"MMBtu/103 gal",null,null,"U.S. Environmental Protection Agency, AP 42, Fifth Edition, Volume I. Chapter 1: External Combustion Sources, Section 5. Liquefied Petroleum Gas Combustion, Final Document, Table 1.5-1.",null,null,null,"http://www.epa.gov/ttn/chief/ap42/ch01/final/c01s05.pdf",null,null,null,null,null,null,null,null,63,"WECC Northwest",80127.8,1070279319.821,269253053.412,76424.856,36116.133999999998,85048260.979000002,0.56799999999999995,0.26800000000000002,631.73500000000001,0.14299999999999999,0.13900000000000001,6.7000000000000004E-2,158.92699999999999,1.3089999999999999,0.61099999999999999,1515.2719999999999,0.14099999999999999,6.6000000000000003E-2,162.89699999999999,44073818.884999998,557911.30900000001,66832940.434,698501.56700000004,0.16400000000000001,2E-3,0.248,3.0000000000000001E-3,0.42699999999999999,3974.9941783698264,9542.1634291893788,null,null,null,null,null,null,null,null,null,null,null,null,null,null,null,null,null,null,null,null,null,null,null,"GA_Fossil",1194.4459999999999,0.217,0.39500000000000002,8768.8608151613753,null,null,null,null,null,null,null,null,null,null,null,null,null,null,"NPCC NYC/Westchester","NPCC NYC/Westchester"]
[null,null,"Propane CO2 Emission Factor",null,12500,"lb/103 gal",null,null,"U.S. Environmental Protection Agency, AP 42, Fifth Edition, Volume I. Chapter 1: External Combustion Sources, Section 5. Liquefied Petroleum Gas Combustion, Final Document, Table 1.5-1.",null,null,null,"http://www.epa.gov/ttn/chief/ap42/ch01/final/c01s05.pdf",null,null,null,null,null,null,null,null,64,"NPCC NYC/Westchester",12789.9,252215160.57100001,34602268.097000003,4020.2579999999998,411.95699999999999,14956294.376,0.23200000000000001,2.4E-2,864.46900000000005,3.2000000000000001E-2,3.4000000000000002E-2,3.0000000000000001E-3,118.599,0.20399999999999999,6.0000000000000001E-3,862.98,2.8000000000000001E-2,1E-3,118.73099999999999,0,159815.32,33991490.674999997,248637.79300000001,0,5.0000000000000001E-3,0.98199999999999998,7.0000000000000001E-3,0.999,7288.9777012295599,7331.8480438616944,null,null,null,null,null,null,null,null,null,null,null,null,null,null,null,null,null,null,null,null,null,null,null,"HI_Fossil",1650.194,5.35,6.0140000000000002,11070.39638190699,null,null,null,null,null,null,null,null,null,null,null,null,null,null,"NPCC Long Island","NPCC Long Island"]
[null,null,"Propane SO2 Emission Factor",null,0.1,"lb/103 gal",null,null,"U.S. Environmental Protection Agency, AP 42, Fifth Edition, Volume I. Chapter 1: External Combustion Sources, Section 5. Liquefied Petroleum Gas Combustion, Final Document, Table 1.5-1.",null,null,null,"http://www.epa.gov/ttn/chief/ap42/ch01/final/c01s05.pdf",null,null,null,null,null,null,null,null,65,"NPCC Long Island",5832.8,98137990.312000006,9823461.8080000002,4072.7260000000001,1624.36,5799143.1409999998,0.82899999999999996,0.33100000000000002,1180.672,8.3000000000000004E-2,7.6999999999999999E-2,3.3000000000000002E-2,118.18300000000001,0.54200000000000004,4.3999999999999997E-2,1117.979,5.8000000000000003E-2,5.0000000000000001E-3,119.788,0,148764.20499999999,8563061.8049999997,474533.33100000001,0,1.4999999999999999E-2,0.872,4.8000000000000001E-2,0.97499999999999998,{"$f":"Y74/Z74*1000","v":9990.163572690708},{"$f":"Y74/(SUM(AQ74:AT74))*1000","v":10683.012352238007},null,null,null,null,null,null,null,null,null,null,null,null,null,null,null,null,null,null,null,null,null,null,null,"IA_Fossil",1641.0650000000001,1.3520000000000001,1,9226.6262817259067,null,null,null,null,null,null,null,null,null,null,null,null,null,null,"NPCC Upstate NY","NPCC Upstate NY"]
[null,null,"Propane NOX Emission Factor",null,13,"lb/103 gal",null,null,"U.S. Environmental Protection Agency, AP 42, Fifth Edition, Volume I. Chapter 1: External Combustion Sources, Section 5. Liquefied Petroleum Gas Combustion, Final Document, Table 1.5-1.",null,null,null,"http://www.epa.gov/ttn/chief/ap42/ch01/final/c01s05.pdf",null,null,null,null,null,null,null,null,66,"NPCC Upstate NY",26425.4,188491604.949,85283183.253999993,3545.1019999999999,1141.357,10323051.399,8.3000000000000004E-2,2.7E-2,242.089,3.7999999999999999E-2,3.5000000000000003E-2,1.2E-2,109.533,0.219,4.2999999999999997E-2,914.08799999999997,2.8000000000000001E-2,6.0000000000000001E-3,115.723,0,113096.45699999999,21749608.456,269550.5,0,1E-3,0.255,3.0000000000000001E-3,0.27200000000000002,2210.1849128639233,8516.6017394812898,null,null,null,null,null,null,null,null,null,null,null,null,null,null,null,null,null,null,null,null,null,null,null,"ID_Fossil",981.77499999999998,5.0000000000000001E-3,0.22600000000000001,8751.7640056197961,null,null,null,null,null,null,null,null,null,null,null,null,null,null,"RFC East","RFC East"]
[null,null,"Heating Oil (No. 2) Heat Content",null,140,"MMBtu/103 gal",null,null,"U.S. Environmental Protection Agency, AP 42, Fifth Edition, Volume I. Chapter 1: External Combustion Sources, Section 3. Fuel Oil Combustion, Background Document.",null,null,null,"http://www.epa.gov/ttn/chief/ap42/ch01/bgdocs/b01s03.pdf",null,null,null,null,null,null,null,null,67,"RFC East",76472.899999999994,1346005571.1589999,284874108.50999999,28833.010999999999,30183.773000000001,85021258.144999996,0.20200000000000001,0.21199999999999999,596.904,4.2999999999999997E-2,4.2000000000000003E-2,4.4999999999999998E-2,126.331,0.27,0.29799999999999999,981.029,3.5000000000000003E-2,3.9E-2,128.12,13525528.085999999,161138.85200000001,154199477.75299999,2056177.5109999999,4.7E-2,1E-3,0.54100000000000004,7.0000000000000001E-3,0.60499999999999998,4724.9136757254682,7920.3670617086527,null,null,null,null,null,null,null,null,null,null,null,null,null,null,null,null,null,null,null,null,null,null,null,"IL_Fossil",1498.7180000000001,0.85499999999999998,0.53200000000000003,9057.4138093748934,null,null,null,null,null,null,null,null,null,null,null,null,null,null,"RFC Michigan","RFC Michigan"]
[null,null,"Heating Oil (No. 2) CO2 Emission Factor",null,22300,"lb/103 gal",null,null,"U.S. Environmental Protection Agency, AP 42, Fifth Edition, Volume I. Chapter 1: External Combustion Sources, Section 3. Fuel Oil Combustion, Background Document. Table 6.",null,null,null,"http://www.epa.gov/ttn/chief/ap42/ch01/bgdocs/b01s03.pdf",null,null,null,null,null,null,null,null,68,"RFC Michigan",28925.4,630197074.31400001,91629481.603,23798.385999999999,25854.171999999999,44468548.656000003,0.51900000000000002,0.56399999999999995,970.61699999999996,7.5999999999999998E-2,7.0000000000000007E-2,8.2000000000000003E-2,141.126,0.62,0.70399999999999996,1230.8489999999999,7.2999999999999995E-2,8.3000000000000004E-2,145.51900000000001,23554195.386,1339754.118,45647800.803999998,1500003.125,0.25700000000000001,1.4999999999999999E-2,0.498,1.6E-2,0.80100000000000005,6877.6671360472583,8747.6642958183074,null,null,null,null,null,null,null,null,null,null,null,null,null,null,null,null,null,null,null,null,null,null,null,"IN_Fossil",1682.347,0.65500000000000003,0.95,9191.9319632137904,null,null,null,null,null,null,null,null,null,null,null,null,null,null,"RFC West","RFC West"]
[null,null,"Heating Oil (No. 2) SO2 Emission Factor",null,142,"lb/103 gal",null,null,"U.S. Environmental Protection Agency, AP 42, Fifth Edition, Volume I. Chapter 1: External Combustion Sources, Section 3. Fuel Oil Combustion, Final Document. Table 1.3-1",null,null,null,"http://www.epa.gov/ttn/chief/ap42/ch01/bgdocs/b01s03.pdf",null,null,null,null,null,null,null,null,69,"RFC West",141910.20000000001,2944467945.4229999,524352082.167,110512.788,108122.61500000001,238953647.79300001,0.42199999999999999,0.41199999999999998,911.42399999999998,7.4999999999999997E-2,6.0999999999999999E-2,7.2999999999999995E-2,162.30699999999999,0.65100000000000002,0.64900000000000002,1426.364,7.3999999999999996E-2,7.3999999999999996E-2,162.577,131181429.27500001,1329401.0279999999,198423277.38600001,3871616.2230000002,0.25,3.0000000000000001E-3,0.378,7.0000000000000001E-3,0.64200000000000002,5615.4405514217478,8794.5567686797403,null,null,null,null,null,null,null,null,null,null,null,null,null,null,null,null,null,null,null,null,null,null,null,"KS_Fossil",2054.4630000000002,0.317,1.3979999999999999,10839.620412629345,null,null,null,null,null,null,null,null,null,null,null,null,null,null,"WECC Rockies","WECC Rockies"]
[null,null,"Heating Oil (No. 2) NOX Emission Factor",null,24,"lb/103 gal",null,null,"U.S. Environmental Protection Agency, AP 42, Fifth Edition, Volume I. Chapter 1: External Combustion Sources, Section 3. Fuel Oil Combustion, Background Document. Table 2.",null,null,null,"http://www.epa.gov/ttn/chief/ap42/ch01/bgdocs/b01s03.pdf",null,null,null,null,null,null,null,null,70,"WECC Rockies",24805.7,403363462.42699999,67674810.481000006,17789.061000000002,11143.956,35075879.989,0.52600000000000002,0.32900000000000001,1036.6010000000001,8.7999999999999995E-2,8.5999999999999993E-2,5.5E-2,173.917,0.89700000000000002,0.56599999999999995,1783.758,8.7999999999999995E-2,5.5E-2,174.636,21439207.649999999,47422.453999999998,17841440.375,0,0.317,1E-3,0.26400000000000001,0,0.58299999999999996,5960.3190546096321,10256.375599265259,null,null,null,null,null,null,null,null,null,null,null,null,null,null,null,null,null,null,null,null,null,null,null,"KY_Fossil",1870.3589999999999,1.1890000000000001,1.028,9975.3434141336784,null,null,null,null,null,null,null,null,null,null,null,null,null,null,"SPP North","SPP North"]
[null,null,"U.S. Transmission and Distribution Electricity Losses",null,5.2999999999999999E-2,"Percent",null,null,"U.S. Energy Information Administration, Frequently Asked Questions, \"How much electricity is lost in transmission and distribution in the United States?\"",null,null,null,"http://www.eia.gov/tools/faqs/faq.cfm?id=105&t=3",null,null,null,null,null,null,null,null,71,"SPP North",27920.2,348588597.30699998,73458953.048999995,16956.454000000002,5045.1760000000004,31660769.923,0.46200000000000002,0.13700000000000001,861.99900000000002,9.7000000000000003E-2,9.5000000000000001E-2,2.9000000000000001E-2,181.65100000000001,1.0069999999999999,0.29899999999999999,1880.77,9.8000000000000004E-2,2.9000000000000001E-2,182.07400000000001,23239668.982999999,149995.78599999999,10273827.391000001,0,0.316,2E-3,0.14000000000000001,0,0.45900000000000002,4745.3521026154258,10355.093157007748,null,null,null,null,null,null,null,null,null,null,null,null,null,null,null,null,null,null,null,null,null,null,null,"LA_Fossil",916.52200000000005,0.19,0.78500000000000003,7371.8394495146367,null,null,null,null,null,null,null,null,null,null,null,null,null,null,"SPP South","SPP South"]
[null,null,"Metric Tons of CO2e per passenger vehicle per year",null,4.5999999999999996,"tonnes",null,null,"U.S. Environmental Protection Agency, Greenhouse Gas Equivalencies Calculator, Calculations and References, Passenger Vehicles per Year",null,null,null,"https://www.epa.gov/energy/ghg-equivalencies-calculator-calculations-and-references",null,null,null,null,null,null,null,null,72,"SPP South",58598.400000000001,945309503.773,158074959.653,53225.995999999999,52040.372000000003,68923985.644999996,0.67300000000000004,0.65800000000000003,872.04200000000003,0.113,0.112,0.11,145.82300000000001,1.0349999999999999,1.0049999999999999,1380.0060000000001,0.11,0.107,147.15,25682670.022,850341.87899999996,72817309.207000002,283095.52,0.16200000000000001,5.0000000000000001E-3,0.46100000000000002,2E-3,0.64300000000000002,5980.1343985670264,9487.876013551655,null,null,null,null,null,null,null,null,null,null,null,null,null,null,null,null,null,null,null,null,null,null,null,"MA_Fossil",861.47699999999998,1.6E-2,0.22600000000000001,8845.8907810739565,null,null,null,null,null,null,null,null,null,null,null,null,null,null,"SERC Mississippi Valley","SERC Mississippi Valley"]
[null,null,"Metric Tons of CO2 per home electricity usage per year",null,4.798,"tonnes",null,null,"U.S. Environmental Protection Agency, Greenhouse Gas Equivalencies Calculator, Calculations and References, Home Electricity Use",null,null,null,"https://www.epa.gov/energy/ghg-equivalencies-calculator-calculations-and-references",null,null,null,null,null,null,null,null,73,"SERC Mississippi Valley",48030.5,998065840.55799997,176359169.82600001,43011.014000000003,30918.967000000001,65228228.092,0.48799999999999999,0.35099999999999998,739.72,8.5999999999999993E-2,8.8999999999999996E-2,6.2E-2,130.709,0.64500000000000002,0.45200000000000001,1002.079,8.5000000000000006E-2,0.06,132.59299999999999,14512733.6,261575.28,115002121.84199999,2197986.679,8.2000000000000003E-2,1E-3,0.65200000000000002,1.2E-2,0.75800000000000001,5659.2795347285573,7562.5705361169294,null,null,null,null,null,null,null,null,null,null,null,null,null,null,null,null,null,null,null,null,null,null,null,"MD_Fossil",1045.885,0.17199999999999999,0.28399999999999997,8423.3431645371838,null,null,null,null,null,null,null,null,null,null,null,null,null,null,"SERC Midwest","SERC Midwest"]
[null,null,"U.S. Emissions Data (CO2, SO2, NOX)",null,"---","---",null,null,"eGRID2023 (2021 data)",null,null,null,"https://www.epa.gov/energy/emissions-generation-resource-integrated-database-egrid",null,null,null,null,null,null,null,null,74,"SERC Midwest",31516.400000000001,688224944.11000001,105391939.28200001,41447.964999999997,86208.354999999996,65334512.752999999,0.78700000000000003,1.6359999999999999,1239.8389999999999,0.12,8.3000000000000004E-2,0.251,189.864,1.149,2.39,1811.875,0.121,0.251,190.173,53815391.505000003,62107.993999999999,17851869.355,68113.898000000001,0.51100000000000001,1E-3,0.16900000000000001,1E-3,0.68300000000000005,6530.1478348215824,9585.6416928604467,null,null,null,null,null,null,null,null,null,null,null,null,null,null,null,null,null,null,null,null,null,null,null,"ME_Fossil",847.14400000000001,7.6999999999999999E-2,0.14599999999999999,10396.474958881301,null,null,null,null,null,null,null,null,null,null,null,null,null,null,"SERC South","SERC South"]
[null,null,"Canada Emissions Data (CO2)",null,"---","---",null,null,"Canada's Official Greenhouse Gas Inventory, 4/14/22",null,null,null,"https://data.ec.gc.ca/data/substances/monitor/canada-s-official-greenhouse-gas-inventory/C-Tables-Electricity-Canada-Provinces-Territories/EN_Electricity_Can_Prov_Terr.xlsx ",null,null,null,null,null,null,null,null,75,"SERC South",73016.5,1563781148.9860001,256144699.48800001,44434.866000000002,20764.973999999998,107879089.33499999,0.34699999999999998,0.16200000000000001,842.32899999999995,5.7000000000000002E-2,5.1999999999999998E-2,2.7E-2,137.97200000000001,0.438,0.121,1203.3889999999999,5.1999999999999998E-2,1.4999999999999999E-2,144.05000000000001,37243401.545000002,266599.25300000003,142008879.06200001,90945.407000000007,0.14499999999999999,1E-3,0.55400000000000005,0,0.73699999999999999,6105.0693303894068,8706.5456840200823,null,null,null,null,null,null,null,null,null,null,null,null,null,null,null,null,null,null,null,null,null,null,null,"MI_Fossil",1181.8140000000001,0.63600000000000001,0.8,8601.3150211506563,null,null,null,null,null,null,null,null,null,null,null,null,null,null,"SERC Tennessee Valley","SERC Tennessee Valley"]
[null,null,"Canada Emissions Data (SO2, NOX)",null,"---","---",null,null,"National Pollutant Release Inventory (NPRI) Downloadable Datasets, 2011 Air Pollutant Emission Summaries and Trends. 2011 Emissions from Electric Power Generation (Utilities)",null,null,null,"http://www.ec.gc.ca/inrp-npri/default.asp?lang=en&n=0EC58C98-#Emission_Summaries",null,null,null,null,null,null,null,null,76,"SERC Tennessee Valley",59035.5,1117324874.1270001,209324307.72999999,40143.699000000001,44668.688000000002,93994898.715000004,0.38400000000000001,0.42699999999999999,898.07899999999995,7.1999999999999995E-2,6.5000000000000002E-2,0.08,168.25,0.64500000000000002,0.71699999999999997,1558.384,7.0999999999999994E-2,7.8E-2,170.38300000000001,58936646.203000002,150251.51300000001,62365849.762999997,101969.859,0.28199999999999997,1E-3,0.29799999999999999,0,0.58699999999999997,5337.7693505533907,9191.9499184891447,null,null,null,null,null,null,null,null,null,null,null,null,null,null,null,null,null,null,null,null,null,null,null,"MN_Fossil",1570.972,0.28199999999999997,0.88100000000000001,9747.6509466911302,null,null,null,null,null,null,null,null,null,null,null,null,null,null,"SERC Virginia/Carolina","SERC Virginia/Carolina"]
[null,null,null,null,null,null,null,null,null,null,null,null,null,null,null,null,null,null,null,null,null,77,"SERC Virginia/Carolina",96953.9,1400412212.5220001,319478860.92799997,44977.082999999999,24261.312999999998,94792347.165000007,0.28199999999999997,0.152,593.41899999999998,6.4000000000000001E-2,6.7000000000000004E-2,3.5000000000000003E-2,135.37799999999999,0.51,0.24299999999999999,1177.4090000000001,6.0999999999999999E-2,2.9000000000000001E-2,141.488,33607489.832999997,306042.272,125405483.38,522985.87900000002,0.105,1E-3,0.39300000000000002,2E-3,0.52100000000000002,4383.4268359858934,8761.2279661896464,null,null,null,null,null,null,null,null,null,null,null,null,null,null,null,null,null,null,null,null,null,null,null,"MO_Fossil",1934.34,2.919,1.4179999999999999,10002.804187114007,null,null,null,null,null,null,null,null,null,null,null,null,null,null,"Alaska Systems Coordinating Council","Alaska Systems Coordinating Council"]
[null,null,"Calculations",null,null,null,null,null,null,null,null,null,null,null,null,null,null,null,null,null,null,78,"Alaska",3095.5,39933923.741999999,6678905.1610000003,20591.981,1349.979,2704368.9870000002,6.1660000000000004,0.40400000000000003,809.82399999999996,1.0309999999999999,1.107,6.8000000000000005E-2,135.44200000000001,8.6310000000000002,0.56299999999999994,1134.6969999999999,1.0409999999999999,6.8000000000000005E-2,136.80500000000001,730681.46,848592.32499999995,3182407.1030000001,0,0.109,0.127,0.47599999999999998,0,0.71899999999999997,5979.1122615702616,8386.5182655642075,null,null,null,null,null,null,null,null,null,null,null,null,null,null,null,null,null,null,null,null,null,null,null,"MS_Fossil",1020.0549999999999,9.5000000000000001E-2,0.43099999999999999,8007.254476916055,null,null,null,null,null,null,null,null,null,null,null,null,null,null,"Florida Reliability Coordinating Council","Florida Reliability Coordinating Council"]
[null,null,null,null,null,null,null,null,null,null,null,null,null,null,{"$f":"2650000/4.73","v":560253.69978858344},null,null,null,null,null,null,79,"Hawaii",3451.2,81226059.821999997,9158617.7329999991,22671.584999999999,19871.901999999998,6342943.2209999999,4.9509999999999996,4.3390000000000004,1385.1310000000001,0.55800000000000005,0.54500000000000004,0.48899999999999999,156.18,6.0140000000000002,5.35,1650.194,0.59,0.52500000000000002,161.90600000000001,0,7159456.4289999995,0,177774.96,0,0.78200000000000003,0,1.9E-2,0.83299999999999996,8868.812105709927,11070.39638190699,null,null,null,null,null,null,null,null,null,null,null,null,null,null,null,null,null,null,null,null,null,null,null,"MT_Fossil",2175.8679999999999,1.6659999999999999,1.7949999999999999,10697.129737999363,null,null,null,null,null,null,null,null,null,null,null,null,null,null,"Hawaiian Islands Coordinating Council","Hawaiian Islands Coordinating Council"]
[null,null,"Description",null,"Value","Units",null,null,null,null,null,null,null,null,null,null,null,null,null,null,null,80,"Midwest Reliability Organization",165769.9,2370771587.5100002,470517339.44,149368.34599999999,151587.223,201590347.21900001,0.63500000000000001,0.64400000000000002,856.88800000000003,0.126,0.124,0.128,170.06299999999999,1.206,1.2390000000000001,1676.509,0.123,0.127,171.58199999999999,127688066.31299999,502523.95299999998,111308390.15700001,640889.68500000006,0.27100000000000002,1E-3,0.23699999999999999,1E-3,0.51600000000000001,5038.6487144802004,9872.4613553083655,null,null,null,null,null,null,null,null,null,null,null,null,null,null,null,null,null,null,null,null,null,null,null,"NC_Fossil",1194.4960000000001,0.26700000000000002,0.71299999999999997,8673.8404329220066,null,null,null,null,null,null,null,null,null,null,null,null,null,null,"Midwest Reliability Organization","Midwest Reliability Organization"]
[null,null,"User Input",null,{"$f":"E24","v":"US Average"},null,null,null,null,null,null,null,null,null,null,null,null,null,null,null,null,81,"Northeast Power Coordinating Council",82817.8,1001469468.554,226148074.90700001,26284.69,9102.7690000000002,56412217.171999998,0.23200000000000001,8.1000000000000003E-2,498.89600000000002,5.1999999999999998E-2,0.05,1.7999999999999999E-2,112.65900000000001,0.25,2.5999999999999999E-2,893.50699999999995,3.3000000000000002E-2,3.0000000000000001E-3,118.404,203345.326,801636.12699999998,115359502.639,2557653.9589999998,1E-3,4.0000000000000001E-3,0.51,1.0999999999999999E-2,0.55200000000000005,4428.3793658904206,8421.2198415447074,null,null,null,null,null,null,null,null,null,null,null,null,null,null,null,null,null,null,null,null,null,null,null,"ND_Fossil",2132.674,2.6539999999999999,2.194,10097.907395937662,null,null,null,null,null,null,null,null,null,null,null,null,null,null,"No NERC region","No NERC region"]
[null,null,"User Input",null,{"$f":"E22","v":"eGrid Subregions Average Fossil"},null,null,null,null,null,null,null,null,null,null,null,null,null,null,null,null,82,"Reliability First Corporation",250781.4,5006388437.7480001,909114739.10800004,166600.58300000001,166349.087,375109100.727,0.36699999999999999,0.36599999999999999,825.21799999999996,6.7000000000000004E-2,5.7000000000000002E-2,6.6000000000000003E-2,149.852,0.53800000000000003,0.55000000000000004,1269.8219999999999,6.4000000000000001E-2,6.6000000000000003E-2,151.297,171753438.83000001,2873619.122,405714769.89200002,7457143.8619999997,0.189,3.0000000000000001E-3,0.44600000000000001,8.0000000000000002E-3,0.65300000000000002,5506.8829294970392,8517.1779447277586,null,null,null,null,null,null,null,null,null,null,null,null,null,null,null,null,null,null,null,null,null,null,null,"NE_Fossil",2071.3449999999998,4.3099999999999996,1.9059999999999999,10318.823026246035,null,null,null,null,null,null,null,null,null,null,null,null,null,null,"Northeast Power Coordinating Council","Northeast Power Coordinating Council"]
[null,null,"Electricity Consumption (kWh/yr)",null,{"$f":"E13/(1-$E$80)","v":13593.146166400555},"kWh",null,null,{"$f":"I13/(1-$E$80)","v":0},null,{"$f":"K13/(1-$E$80)","v":0},null,{"$f":"M13/(1-$E$80)","v":0},null,{"$f":"O13/(1-$E$80)","v":0},null,{"$f":"Q13/(1-$E$80)","v":0},null,{"$f":"S13/(1-$E$80)","v":0},null,null,83,"SERC Reliability Corporation",385791.2,7482938945.6470003,1333721076.0420001,252320.02100000001,229681.81200000001,534347899.91000003,0.378,0.34399999999999997,801.28899999999999,6.7000000000000004E-2,6.2E-2,6.0999999999999999E-2,142.81800000000001,0.52700000000000002,0.47099999999999997,1207.9570000000001,6.4000000000000001E-2,5.7000000000000002E-2,146.70099999999999,209361939.61700001,3031712.1,668362826.03400004,4457623.9359999998,0.157,2E-3,0.501,3.0000000000000001E-3,0.68100000000000005,5610.572615267989,8453.2532088975549,null,null,null,null,null,null,null,null,null,null,null,null,null,null,null,null,null,null,null,null,null,null,null,"NH_Fossil",929.24800000000005,0.10299999999999999,0.253,10374.523923648789,null,null,null,null,null,null,null,null,null,null,null,null,null,null,"Reliability First Corporation","Reliability First Corporation"]
[null,null,"Natural Gas Consumption (MMBtu/yr)",null,{"$f":"E15","v":0},"MMBtu",null,null,{"$f":"I15","v":90.935915472557525},null,{"$f":"K15","v":0},null,{"$f":"M15","v":0},null,{"$f":"O15","v":0},null,{"$f":"Q15","v":0},null,{"$f":"S15","v":0},null,null,84,"Texas Regional Entity",144275.6,2410651892.8449998,472122306.10100001,105048.878,76086.145000000004,173245756.19600001,0.44500000000000001,0.32200000000000001,733.90200000000004,8.6999999999999994E-2,8.5999999999999993E-2,6.3E-2,143.73400000000001,0.71899999999999997,0.51900000000000002,1181.2059999999999,8.7999999999999995E-2,6.3E-2,144.393,60420147.399999999,213046.005,232718819.76100001,1696010.173,0.128,0,0.49299999999999999,4.0000000000000001E-3,0.627,5105.9902522997809,8170.3712689349022,null,null,null,null,null,null,null,null,null,null,null,null,null,null,null,null,null,null,null,null,null,null,null,"NJ_Fossil",837.90899999999999,6.0000000000000001E-3,0.19400000000000001,7636.712491928698,null,null,null,null,null,null,null,null,null,null,null,null,null,null,"SERC Reliability Corporation","SERC Reliability Corporation"]
[null,null,"Annual Propane Consumption (gal)",null,{"$f":"E17","v":0},"gal",null,null,{"$f":"I17","v":0},null,{"$f":"K17","v":0},null,{"$f":"M17","v":0},null,{"$f":"O17","v":0},null,{"$f":"Q17","v":0},null,{"$f":"S17","v":0},null,null,85,"Western Electricity Coordinating Council",261053.5,3322275085.8439999,746008725.74300003,170460.342,66157.922000000006,244420920.03,0.45700000000000002,0.17699999999999999,655.27599999999995,0.10299999999999999,0.1,0.04,147.14099999999999,0.86899999999999999,0.34599999999999997,1323.4690000000001,9.9000000000000005E-2,0.04,151.43100000000001,101892622.618,749869.96499999997,264908602.706,2182174.7409999999,0.13700000000000001,1E-3,0.35499999999999998,3.0000000000000001E-3,0.50700000000000001,4453.3997675900155,8985.5994987262893,null,null,null,null,null,null,null,null,null,null,null,null,null,null,null,null,null,null,null,null,null,null,null,"NM_Fossil",1399.692,0.192,0.67500000000000004,9194.945185988925,null,null,null,null,null,null,null,null,null,null,null,null,null,null,"Southwest Power Pool","Southwest Power Pool"]
[null,null,"Annual Heating Oil Consumption (gal)",null,{"$f":"E19","v":0},"gal",null,null,{"$f":"I19","v":0},null,{"$f":"K19","v":0},null,{"$f":"M19","v":0},null,{"$f":"O19","v":0},null,{"$f":"Q19","v":0},null,{"$f":"S19","v":0},null,null,null,null,null,null,null,null,null,null,null,null,null,null,null,null,null,null,null,null,null,null,null,null,null,null,null,null,null,null,null,null,null,null,null,null,null,null,null,null,null,null,null,null,null,null,null,null,null,null,null,null,null,null,null,null,null,"NV_Fossil",1009.955,0.215,0.754,7866.786881877315,null,null,null,null,null,null,null,null,null,null,null,null,null,null,"Texas Regional Entity","Texas Regional Entity"]
[null,null,null,null,null,null,null,null,null,null,null,null,null,null,null,null,null,null,null,null,null,null,null,null,null,null,null,null,null,null,null,null,null,null,null,null,null,null,null,null,null,null,null,null,null,null,null,null,null,null,null,null,null,null,null,null,null,null,null,null,null,null,null,null,null,null,null,null,null,null,null,null,null,null,null,null,"NY_Fossil",933.79200000000003,2.5999999999999999E-2,0.27200000000000002,8413.4992798538551,null,null,null,null,null,null,null,null,null,null,null,null,null,null,"Western Electricity Coordinating Council","Western Electricity Coordinating Council"]
[null,null,null,null,null,null,null,null,null,null,null,null,null,null,null,null,null,null,null,null,null,null,null,null,null,null,null,null,null,null,null,null,null,null,null,null,null,null,null,null,null,null,null,null,null,null,null,null,null,null,null,null,null,null,null,null,null,null,null,null,null,null,null,null,null,null,null,null,null,null,null,null,null,null,null,null,"OH_Fossil",1261.2280000000001,0.72499999999999998,0.40300000000000002,8392.3001393038849,null,null,null,null,null,null,null,null,null,null,null,null,null,null,"Canada Average",{"$f":"CR97","v":"Canada Average"}]
[null,null,"State Abbrev",null,{"$f":"VLOOKUP(E90,CR:CS,2,0)","v":"US Average"},"---",null,null,null,null,null,null,null,null,null,null,null,null,null,null,null,null,null,null,null,null,null,null,null,null,null,null,null,null,null,null,null,null,null,null,null,null,null,null,null,null,null,null,null,null,null,null,null,null,null,null,null,null,null,null,null,null,null,null,null,null,null,null,null,null,null,null,null,null,null,null,"OK_Fossil",1150.2249999999999,0.378,0.82899999999999996,8897.7227244840724,null,null,null,null,null,null,null,null,null,null,null,null,null,null,"Alberta","Alberta"]
[null,null,"U.S. State Selected?",null,{"$f":"IF(ISERROR(VLOOKUP(E98,$CS$8:$CS$59,1,0)),\"No\", \"Yes\")","v":"Yes"},"Y/N",null,"*this will always be no, but the emissions are always based on eGrid subregion",null,null,null,null,null,null,null,null,null,null,null,null,null,null,null,null,null,null,null,null,null,null,null,null,null,null,null,null,null,null,null,null,null,null,null,null,null,null,null,null,null,null,null,null,null,null,null,null,null,null,null,null,null,null,null,null,null,null,null,null,null,null,null,null,null,null,null,null,"OR_Fossil",956.36400000000003,6.0000000000000001E-3,1.5940000000000001,8488.6679098658751,null,null,null,null,null,null,null,null,null,null,null,null,null,null,"British Columbia","British Columbia"]
[null,null,"U.S. Fossil Emissions Profile?",null,{"$f":"IF(OR(E91=\"eGrid Subregions Average Fossil\",E91=\"NERC Average Fossil\",E91=\"US Average Fossil\"),\"Yes\",\"No\")","v":"Yes"},"Y/N",null,"*this will always be no and is likely not necessary",null,null,null,null,null,null,null,null,null,null,null,null,null,null,null,null,null,null,null,null,null,null,null,null,null,null,null,null,null,null,null,null,null,null,null,null,null,null,null,null,null,null,null,null,null,null,null,null,null,null,null,null,null,null,null,null,null,null,null,null,null,null,null,null,null,null,null,null,"PA_Fossil",979.62599999999998,0.315,0.27100000000000002,7800.2076966749028,null,null,null,null,null,null,null,null,null,null,null,null,null,null,"Manitoba","Manitoba"]
[null,null,"Heat Rate",null,{"$f":"IF($E$100=\"Yes\",VLOOKUP($E$98&\"_Fossil\",$BY:$CC,5,0),VLOOKUP($E$98,$BY:$CC,5,0))","v":8665.4857455159454},"Btu/kWh",null,null,null,null,null,null,null,null,null,null,null,null,null,null,null,null,null,null,null,null,null,null,null,null,null,null,null,null,null,null,null,null,null,null,null,null,null,null,null,null,null,null,null,null,null,null,null,null,null,null,null,null,null,null,null,null,null,null,null,null,null,null,null,null,null,null,null,null,null,null,"RI_Fossil",912.80200000000002,5.0000000000000001E-3,0.40500000000000003,7925.5154485416188,null,null,null,null,null,null,null,null,null,null,null,null,null,null,"New Brunswick","New Brunswick"]
[null,null,"Electricity CO2 Emission Rate",null,{"$f":"IF($E$100=\"Yes\",VLOOKUP($E$98&\"_Fossil\",$BY:$CC,2,0),VLOOKUP($E$98,$BY:$CC,2,0))*(1-G13)","v":1270.259},"lb/MWh",null,null,null,null,null,null,null,null,null,null,null,null,null,null,null,null,null,null,null,null,null,null,null,null,null,null,null,null,null,null,null,null,null,null,null,null,null,null,null,null,null,null,null,null,null,null,null,null,null,null,null,null,null,null,null,null,null,null,null,null,null,null,null,null,null,null,null,null,null,null,"SC_Fossil",1444.126,0.38400000000000001,0.56299999999999994,9436.423144372935,null,null,null,null,null,null,null,null,null,null,null,null,null,null,"Newfoundland","Newfoundland"]
[null,null,"Electricity SO2 Emission Rate",null,{"$f":"IF($E$100=\"Yes\",VLOOKUP($E$98&\"_Fossil\",$BY:$CC,3,0),VLOOKUP($E$98,$BY:$CC,3,0))","v":0.56699999999999995},"lb/MWh",null,null,null,null,null,null,null,null,null,null,null,null,null,null,null,null,null,null,null,null,null,null,null,null,null,null,null,null,null,null,null,null,null,null,null,null,null,null,null,null,null,null,null,null,null,null,null,null,null,null,null,null,null,null,null,null,null,null,null,null,null,null,null,null,null,null,null,null,null,null,"SD_Fossil",1563.701,0.35499999999999998,1.169,9812.0991494146238,null,null,null,null,null,null,null,null,null,null,null,null,null,null,"Nova Scotia","Nova Scotia"]
[null,null,"Electricity NOX Emission Rate",null,{"$f":"IF($E$100=\"Yes\",VLOOKUP($E$98&\"_Fossil\",$BY:$CC,4,0),VLOOKUP($E$98,$BY:$CC,4,0))","v":0.71},"lb/MWh",null,null,null,null,null,null,null,null,null,null,null,null,null,null,null,null,null,null,null,null,null,null,null,null,null,null,null,null,null,null,null,null,null,null,null,null,null,null,null,null,null,null,null,null,null,null,null,null,null,null,null,null,null,null,null,null,null,null,null,null,null,null,null,null,null,null,null,null,null,null,"TN_Fossil",1704.73,0.52400000000000002,0.55500000000000005,9819.8586641521324,null,null,null,null,null,null,null,null,null,null,null,null,null,null,"Ontario","Ontario"]
[null,null,"Natural Gas CO2 Emission Rate",null,{"$f":"(E69/$E$68)*(1-G15)","v":117.64705882352941},"lb/MMBtu",null,null,null,null,null,null,null,null,null,null,null,null,null,null,null,null,null,null,null,null,null,null,null,null,null,null,null,null,null,null,null,null,null,null,null,null,null,null,null,null,null,null,null,null,null,null,null,null,null,null,null,null,null,null,null,null,null,null,null,null,null,null,null,null,null,null,null,null,null,null,"TX_Fossil",1186.826,0.59899999999999998,0.73,8255.6986806197638,null,null,null,null,null,null,null,null,null,null,null,null,null,null,"Prince Edward Island","Prince Edward Island"]
[null,null,"Natural Gas SO2 Emission Rate",null,{"$f":"E70/$E$68","v":5.8823529411764701E-4},"lb/MMBtu",null,null,null,null,null,null,null,null,null,null,null,null,null,null,null,null,null,null,null,null,null,null,null,null,null,null,null,null,null,null,null,null,null,null,null,null,null,null,null,null,null,null,null,null,null,null,null,null,null,null,null,null,null,null,null,null,null,null,null,null,null,null,null,null,null,null,null,null,null,null,"UT_Fossil",1730.799,0.33600000000000002,1.57,9932.8056710814071,null,null,null,null,null,null,null,null,null,null,null,null,null,null,"Quebec","Quebec"]
[null,null,"Natural Gas NOX Emission Rate",null,{"$f":"E71/$E$68","v":0.12342047930283224},"lb/MMBtu",null,null,null,null,null,null,null,null,null,null,null,null,null,null,null,null,null,null,null,null,null,null,null,null,null,null,null,null,null,null,null,null,null,null,null,null,null,null,null,null,null,null,null,null,null,null,null,null,null,null,null,null,null,null,null,null,null,null,null,null,null,null,null,null,null,null,null,null,null,null,"VA_Fossil",897.95399999999995,4.3999999999999997E-2,0.214,8294.0623573800822,null,null,null,null,null,null,null,null,null,null,null,null,null,null,"Saskatchewan","Saskatchewan"]
[null,null,"Propane CO2 Emission Rate",null,{"$f":"E73*(1-G17)","v":12500},"lb/103 gal",null,null,null,null,null,null,null,null,null,null,null,null,null,null,null,null,null,null,null,null,null,null,null,null,null,null,null,null,null,null,null,null,null,null,null,null,null,null,null,null,null,null,null,null,null,null,null,null,null,null,null,null,null,null,null,null,null,null,null,null,null,null,null,null,null,null,null,null,null,null,"VT_Fossil",3308.1320000000001,4.9480000000000004,8.4540000000000006,1619240.0488237869]
[null,null,"Propane SO2 Emission Rate",null,{"$f":"E74","v":0.1},"lb/103 gal",null,null,null,null,null,null,null,null,null,null,null,null,null,null,null,null,null,null,null,null,null,null,null,null,null,null,null,null,null,null,null,null,null,null,null,null,null,null,null,null,null,null,null,null,null,null,null,null,null,null,null,null,null,null,null,null,null,null,null,null,null,null,null,null,null,null,null,null,null,null,"WA_Fossil",1134.4549999999999,0.106,0.66500000000000004,8594.8726205185794]
[null,null,"Propane NOX Emission Rate",null,{"$f":"E75","v":13},"lb/103 gal",null,null,null,null,null,null,null,null,null,null,null,null,null,null,null,null,null,null,null,null,null,null,null,null,null,null,null,null,null,null,null,null,null,null,null,null,null,null,null,null,null,null,null,null,null,null,null,null,null,null,null,null,null,null,null,null,null,null,null,null,null,null,null,null,null,null,null,null,null,null,"WI_Fossil",1539.845,0.159,0.626,9639.8645274514802]
[null,null,"Heating Oil CO2 Emission Rate",null,{"$f":"E77*(1-G19)","v":22300},"lb/103 gal",null,null,null,null,null,null,null,null,null,null,null,null,null,null,null,null,null,null,null,null,null,null,null,null,null,null,null,null,null,null,null,null,null,null,null,null,null,null,null,null,null,null,null,null,null,null,null,null,null,null,null,null,null,null,null,null,null,null,null,null,null,null,null,null,null,null,null,null,null,null,"WV_Fossil",2099.5309999999999,1.609,1.141,10571.221601341316]
[null,null,"Heating Oil SO2 Emission Rate",null,{"$f":"E78","v":142},"lb/103 gal",null,null,null,null,null,null,null,null,null,null,null,null,null,null,null,null,null,null,null,null,null,null,null,null,null,null,null,null,null,null,null,null,null,null,null,null,null,null,null,null,null,null,null,null,null,null,null,null,null,null,null,null,null,null,null,null,null,null,null,null,null,null,null,null,null,null,null,null,null,null,"WY_Fossil",2354.4009999999998,1.4410000000000001,1.554,11492.196746111327]
[null,null,"Heating Oil NOX Emission Rate",null,{"$f":"E79","v":24},"lb/103 gal"]
[null,null,"Electricity Consumption",null,{"$f":"E92*$E$101/1000000","v":117.79121434165873},"MMBtu",null,null,{"$f":"I92*$E$101/1000000","v":0},null,{"$f":"K92*$E$101/1000000","v":0},null,{"$f":"M92*$E$101/1000000","v":0},null,{"$f":"O92*$E$101/1000000","v":0},null,{"$f":"Q92*$E$101/1000000","v":0},null,{"$f":"S92*$E$101/1000000","v":0},null,null,null,null,null,null,null,null,null,null,null,null,null,null,null,null,null,null,null,null,null,null,null,null,null,null,null,null,null,null,null,null,null,null,null,null,null,null,null,null,null,null,null,null,null,null,null,null,null,null,null,null,null,null,null,null,null,"ASCC Alaska Grid",{"$f":"AF61","v":899.63300000000004},0.82099999999999995,0.91400000000000003,{"$f":"AZ61","v":6764.2239602386589}]
[null,null,"Electricity CO2 Emissions",null,{"$f":"E$92/1000*$E102","v":17266.816256185801},"lb",null,null,{"$f":"I$92/1000*$E102","v":0},null,{"$f":"K$92/1000*$E102","v":0},null,{"$f":"M$92/1000*$E102","v":0},null,{"$f":"O$92/1000*$E102","v":0},null,{"$f":"Q$92/1000*$E102","v":0},null,{"$f":"S$92/1000*$E102","v":0},null,null,null,null,null,null,null,null,null,null,null,null,null,null,null,null,null,null,null,null,null,null,null,null,null,null,null,null,null,null,null,null,null,null,null,null,null,null,null,null,null,null,null,null,null,null,null,null,null,null,null,null,null,null,null,null,null,"ASCC Miscellaneous",520.48299999999995,2.359,2.25,3449.6985207727562]
[null,null,"Electricity SO2 Emissions",null,{"$f":"E$92/1000*$E103","v":7.7073138763491134},"lb",null,null,{"$f":"I$92/1000*$E103","v":0},null,{"$f":"K$92/1000*$E103","v":0},null,{"$f":"M$92/1000*$E103","v":0},null,{"$f":"O$92/1000*$E103","v":0},null,{"$f":"Q$92/1000*$E103","v":0},null,{"$f":"S$92/1000*$E103","v":0},null,null,null,null,null,null,null,null,null,null,null,null,null,null,null,null,null,null,null,null,null,null,null,null,null,null,null,null,null,null,null,null,null,null,null,null,null,null,null,null,null,null,null,null,null,null,null,null,null,null,null,null,null,null,null,null,null,"WECC Southwest",703.70299999999997,7.0999999999999994E-2,7.2999999999999995E-2,5043.3600246319647]
[null,null,"Electricity NOX Emissions",null,{"$f":"E$92/1000*$E104","v":9.6511337781443931},"lb",null,null,{"$f":"I$92/1000*$E104","v":0},null,{"$f":"K$92/1000*$E104","v":0},null,{"$f":"M$92/1000*$E104","v":0},null,{"$f":"O$92/1000*$E104","v":0},null,{"$f":"Q$92/1000*$E104","v":0},null,{"$f":"S$92/1000*$E104","v":0},null,null,null,null,null,null,null,null,null,null,null,null,null,null,null,null,null,null,null,null,null,null,null,null,null,null,null,null,null,null,null,null,null,null,null,null,null,null,null,null,null,null,null,null,null,null,null,null,null,null,null,null,null,null,null,null,null,"WECC California",428.464,0.09,9.1999999999999998E-2,3702.7910777458605]
[null,null,"Annual Natural Gas Consumption (MMBtu)",null,{"$f":"E93","v":0},"MMBtu",null,null,{"$f":"I93","v":90.935915472557525},null,{"$f":"K93","v":0},null,{"$f":"M93","v":0},null,{"$f":"O93","v":0},null,{"$f":"Q93","v":0},null,{"$f":"S93","v":0},null,null,null,null,null,null,null,null,null,null,null,null,null,null,null,null,null,null,null,null,null,null,null,null,null,null,null,null,null,null,null,null,null,null,null,null,null,null,null,null,null,null,null,null,null,null,null,null,null,null,null,null,null,null,null,null,null,"ERCOT All",733.86199999999997,8.6999999999999994E-2,8.5999999999999993E-2,5116.8873713140438]
[null,null,"Natural Gas CO2 Emissions",null,{"$f":"$E105*E$93","v":0},"lb",null,null,{"$f":"$E105*I$93","v":10698.342996771473},null,{"$f":"$E105*K$93","v":0},null,{"$f":"$E105*M$93","v":0},null,{"$f":"$E105*O$93","v":0},null,{"$f":"$E105*Q$93","v":0},null,{"$f":"$E105*S$93","v":0},null,null,null,null,null,null,null,null,null,null,null,null,null,null,null,null,null,null,null,null,null,null,null,null,null,null,null,null,null,null,null,null,null,null,null,null,null,null,null,null,null,null,null,null,null,null,null,null,null,null,null,null,null,null,null,null,null,"FRCC All",782.26199999999994,3.9E-2,3.7999999999999999E-2,6243.1080705344975]
[null,null,"Natural Gas SO2 Emissions",null,{"$f":"$E106*E$93","v":0},"lb",null,null,{"$f":"$E106*I$93","v":5.3491714983857366E-2},null,{"$f":"$E106*K$93","v":0},null,{"$f":"$E106*M$93","v":0},null,{"$f":"$E106*O$93","v":0},null,{"$f":"$E106*Q$93","v":0},null,{"$f":"$E106*S$93","v":0},null,null,null,null,null,null,null,null,null,null,null,null,null,null,null,null,null,null,null,null,null,null,null,null,null,null,null,null,null,null,null,null,null,null,null,null,null,null,null,null,null,null,null,null,null,null,null,null,null,null,null,null,null,null,null,null,null,"HICC Miscellaneous",1123.3710000000001,1.026,1.0149999999999999,7375.0381553948137]
[null,null,"Natural Gas NOX Emissions",null,{"$f":"$E107*E$93","v":0},"lb",null,null,{"$f":"$E107*I$93","v":11.223354273464889},null,{"$f":"$E107*K$93","v":0},null,{"$f":"$E107*M$93","v":0},null,{"$f":"$E107*O$93","v":0},null,{"$f":"$E107*Q$93","v":0},null,{"$f":"$E107*S$93","v":0},null,null,null,null,null,null,null,null,null,null,null,null,null,null,null,null,null,null,null,null,null,null,null,null,null,null,null,null,null,null,null,null,null,null,null,null,null,null,null,null,null,null,null,null,null,null,null,null,null,null,null,null,null,null,null,null,null,"HICC Oahu",1489.548,0.41299999999999998,0.40300000000000002,9464.6814567387537]
[null,null,"Propane Consumption",null,{"$f":"E94/1000*$E$72","v":0},"MMBtu",null,null,{"$f":"I94/1000*$E$72","v":0},null,{"$f":"K94/1000*$E$72","v":0},null,{"$f":"M94/1000*$E$72","v":0},null,{"$f":"O94/1000*$E$72","v":0},null,{"$f":"Q94/1000*$E$72","v":0},null,{"$f":"S94/1000*$E$72","v":0},null,null,null,null,null,null,null,null,null,null,null,null,null,null,null,null,null,null,null,null,null,null,null,null,null,null,null,null,null,null,null,null,null,null,null,null,null,null,null,null,null,null,null,null,null,null,null,null,null,null,null,null,null,null,null,null,null,"MRO East",1397.3130000000001,0.112,0.11,8803.1514131956992]
[null,null,"Propane CO2 Emissions",null,{"$f":"E$94*$E108/1000","v":0},"lb",null,null,{"$f":"I$94*$E108/1000","v":0},null,{"$f":"K$94*$E108/1000","v":0},null,{"$f":"M$94*$E108/1000","v":0},null,{"$f":"O$94*$E108/1000","v":0},null,{"$f":"Q$94*$E108/1000","v":0},null,{"$f":"S$94*$E108/1000","v":0},null,null,null,null,null,null,null,null,null,null,null,null,null,null,null,null,null,null,null,null,null,null,null,null,null,null,null,null,null,null,null,null,null,null,null,null,null,null,null,null,null,null,null,null,null,null,null,null,null,null,null,null,null,null,null,null,null,"MRO West",920.13,0.14599999999999999,0.14299999999999999,4877.561776814151]
[null,null,"Propane SO2 Emissions",null,{"$f":"E$94*$E109/1000","v":0},"lb",null,null,{"$f":"I$94*$E109/1000","v":0},null,{"$f":"K$94*$E109/1000","v":0},null,{"$f":"M$94*$E109/1000","v":0},null,{"$f":"O$94*$E109/1000","v":0},null,{"$f":"Q$94*$E109/1000","v":0},null,{"$f":"S$94*$E109/1000","v":0},null,null,null,null,null,null,null,null,null,null,null,null,null,null,null,null,null,null,null,null,null,null,null,null,null,null,null,null,null,null,null,null,null,null,null,null,null,null,null,null,null,null,null,null,null,null,null,null,null,null,null,null,null,null,null,null,null,"NPCC New England",539.27499999999998,0.06,5.5E-2,4890.7195860009851]
[null,null,"Propane NOX Emissions",null,{"$f":"E$94*$E110/1000","v":0},"lb",null,null,{"$f":"I$94*$E110/1000","v":0},null,{"$f":"K$94*$E110/1000","v":0},null,{"$f":"M$94*$E110/1000","v":0},null,{"$f":"O$94*$E110/1000","v":0},null,{"$f":"Q$94*$E110/1000","v":0},null,{"$f":"S$94*$E110/1000","v":0},null,null,null,null,null,null,null,null,null,null,null,null,null,null,null,null,null,null,null,null,null,null,null,null,null,null,null,null,null,null,null,null,null,null,null,null,null,null,null,null,null,null,null,null,null,null,null,null,null,null,null,null,null,null,null,null,null,"WECC Northwest",631.73500000000001,0.14299999999999999,0.13900000000000001,3974.9941783698264]
[null,null,"Heating Oil Consumption",null,{"$f":"E95/1000*$E$76","v":0},"MMBtu",null,null,{"$f":"I95/1000*$E$76","v":0},null,{"$f":"K95/1000*$E$76","v":0},null,{"$f":"M95/1000*$E$76","v":0},null,{"$f":"O95/1000*$E$76","v":0},null,{"$f":"Q95/1000*$E$76","v":0},null,{"$f":"S95/1000*$E$76","v":0},null,null,null,null,null,null,null,null,null,null,null,null,null,null,null,null,null,null,null,null,null,null,null,null,null,null,null,null,null,null,null,null,null,null,null,null,null,null,null,null,null,null,null,null,null,null,null,null,null,null,null,null,null,null,null,null,null,"NPCC NYC/Westchester",864.46900000000005,3.2000000000000001E-2,3.4000000000000002E-2,7288.9777012295599]
[null,null,"Heating Oil CO2 Emissions",null,{"$f":"E$95*$E111/1000","v":0},"lb",null,null,{"$f":"I$95*$E111/1000","v":0},null,{"$f":"K$95*$E111/1000","v":0},null,{"$f":"M$95*$E111/1000","v":0},null,{"$f":"O$95*$E111/1000","v":0},null,{"$f":"Q$95*$E111/1000","v":0},null,{"$f":"S$95*$E111/1000","v":0},null,null,null,null,null,null,null,null,null,null,null,null,null,null,null,null,null,null,null,null,null,null,null,null,null,null,null,null,null,null,null,null,null,null,null,null,null,null,null,null,null,null,null,null,null,null,null,null,null,null,null,null,null,null,null,"*NPCC Long Isalnd has no cities in the lists tab",null,"NPCC Long Island",1180.672,8.3000000000000004E-2,7.6999999999999999E-2,9990.163572690708]
[null,null,"Heating Oil SO2 Emissions",null,{"$f":"E$95*$E112/1000","v":0},"lb",null,null,{"$f":"I$95*$E112/1000","v":0},null,{"$f":"K$95*$E112/1000","v":0},null,{"$f":"M$95*$E112/1000","v":0},null,{"$f":"O$95*$E112/1000","v":0},null,{"$f":"Q$95*$E112/1000","v":0},null,{"$f":"S$95*$E112/1000","v":0},null,null,null,null,null,null,null,null,null,null,null,null,null,null,null,null,null,null,null,null,null,null,null,null,null,null,null,null,null,null,null,null,null,null,null,null,null,null,null,null,null,null,null,null,null,null,null,null,null,null,null,null,null,null,null,null,null,"NPCC Upstate NY",242.089,3.7999999999999999E-2,3.5000000000000003E-2,2210.1849128639233]
[null,null,"Heating Oil NOX Emissions",null,{"$f":"E$95*$E113/1000","v":0},"lb",null,null,{"$f":"I$95*$E113/1000","v":0},null,{"$f":"K$95*$E113/1000","v":0},null,{"$f":"M$95*$E113/1000","v":0},null,{"$f":"O$95*$E113/1000","v":0},null,{"$f":"Q$95*$E113/1000","v":0},null,{"$f":"S$95*$E113/1000","v":0},null,null,null,null,null,null,null,null,null,null,null,null,null,null,null,null,null,null,null,null,null,null,null,null,null,null,null,null,null,null,null,null,null,null,null,null,null,null,null,null,null,null,null,null,null,null,null,null,null,null,null,null,null,null,null,null,null,"RFC East",596.904,4.2999999999999997E-2,4.2000000000000003E-2,4724.9136757254682]
[null,null,"Total CO2 Emissions",null,{"$f":"E115+E119+E123+E127","v":17266.816256185801},"lb",null,null,{"$f":"I115+I119+I123+I127","v":10698.342996771473},null,{"$f":"K115+K119+K123+K127","v":0},null,{"$f":"M115+M119+M123+M127","v":0},null,{"$f":"O115+O119+O123+O127","v":0},null,{"$f":"Q115+Q119+Q123+Q127","v":0},null,{"$f":"S115+S119+S123+S127","v":0},null,null,null,null,null,null,null,null,null,null,null,null,null,null,null,null,null,null,null,null,null,null,null,null,null,null,null,null,null,null,null,null,null,null,null,null,null,null,null,null,null,null,null,null,null,null,null,null,null,null,null,null,null,null,null,null,null,"RFC Michigan",{"$f":"AF77","v":970.61699999999996},7.5999999999999998E-2,7.0000000000000007E-2,6877.6671360472583]
[null,null,"Total SO2 Emissions",null,{"$f":"E116+E120+E124+E128","v":7.7073138763491134},"lb",null,null,{"$f":"I116+I120+I124+I128","v":5.3491714983857366E-2},null,{"$f":"K116+K120+K124+K128","v":0},null,{"$f":"M116+M120+M124+M128","v":0},null,{"$f":"O116+O120+O124+O128","v":0},null,{"$f":"Q116+Q120+Q124+Q128","v":0},null,{"$f":"S116+S120+S124+S128","v":0},null,null,null,null,null,null,null,null,null,null,null,null,null,null,null,null,null,null,null,null,null,null,null,null,null,null,null,null,null,null,null,null,null,null,null,null,null,null,null,null,null,null,null,null,null,null,null,null,null,null,null,null,null,null,null,null,null,"RFC West",911.42399999999998,7.4999999999999997E-2,6.0999999999999999E-2,5615.4405514217478]
[null,null,"Total NOX Emissions",null,{"$f":"E117+E121+E125+E129","v":9.6511337781443931},"lb",null,null,{"$f":"I117+I121+I125+I129","v":11.223354273464889},null,{"$f":"K117+K121+K125+K129","v":0},null,{"$f":"M117+M121+M125+M129","v":0},null,{"$f":"O117+O121+O125+O129","v":0},null,{"$f":"Q117+Q121+Q125+Q129","v":0},null,{"$f":"S117+S121+S125+S129","v":0},null,null,null,null,null,null,null,null,null,null,null,null,null,null,null,null,null,null,null,null,null,null,null,null,null,null,null,null,null,null,null,null,null,null,null,null,null,null,null,null,null,null,null,null,null,null,null,null,null,null,null,null,null,null,null,null,null,"WECC Rockies",1036.6010000000001,8.7999999999999995E-2,8.5999999999999993E-2,5960.3190546096321]
[null,null,"CO2 Emission Savings",null,{"$f":"-(E130-E130)","v":0},"lb",null,null,{"$f":"-(I130-$E130)","v":6568.4732594143279},null,null,null,null,null,null,null,null,null,null,null,null,null,null,null,null,null,null,null,null,null,null,null,null,null,null,null,null,null,null,null,null,null,null,null,null,null,null,null,null,null,null,null,null,null,null,null,null,null,null,null,null,null,null,null,null,null,null,null,null,null,null,null,null,null,null,null,"SPP North",861.99900000000002,9.7000000000000003E-2,9.5000000000000001E-2,4745.3521026154258]
[null,null,"SO2 Emission Savings",null,{"$f":"-(E131-$E131)","v":0},"lb",null,null,{"$f":"-(I131-$E131)","v":7.6538221613652562},null,null,null,null,null,null,null,null,null,null,null,null,null,null,null,null,null,null,null,null,null,null,null,null,null,null,null,null,null,null,null,null,null,null,null,null,null,null,null,null,null,null,null,null,null,null,null,null,null,null,null,null,null,null,null,null,null,null,null,null,null,null,null,null,null,null,null,"SPP South",872.04200000000003,0.113,0.112,5980.1343985670264]
[null,null,"NOX Emission Savings",null,{"$f":"-(E132-$E132)","v":0},"lb",null,null,{"$f":"-(I132-$E132)","v":-1.5722204953204955},null,null,null,null,null,null,null,null,null,null,null,null,null,null,null,null,null,null,null,null,null,null,null,null,null,null,null,null,null,null,null,null,null,null,null,null,null,null,null,null,null,null,null,null,null,null,null,null,null,null,null,null,null,null,null,null,null,null,null,null,null,null,null,null,null,null,null,"SERC Mississippi Valley",739.72,8.5999999999999993E-2,8.8999999999999996E-2,5659.2795347285573]
[null,null,"CO2 Emissions Delta",null,{"$f":"E133/2000/1.1023","v":0},"metric tons",null,null,{"$f":"I133/2000/1.1023","v":2.9794399253444288},null,{"$f":"K133/2000/1.1023","v":0},null,0,null,0,null,0,null,0,null,null,null,null,null,null,null,null,null,null,null,null,null,null,null,null,null,null,null,null,null,null,null,null,null,null,null,null,null,null,null,null,null,null,null,null,null,null,null,null,null,null,null,null,null,null,null,null,null,null,null,null,null,null,null,null,null,"SERC Midwest",1239.8389999999999,0.12,8.3000000000000004E-2,6530.1478348215824]
[null,null,"Cars off Highway (CO2 Equivalent)",null,{"$f":"E136/$E$81","v":0},"cars",null,null,{"$f":"I136/$E$81","v":0.647704331596615},null,{"$f":"K136/$E$81","v":0},null,{"$f":"M136/$E$81","v":0},null,{"$f":"O136/$E$81","v":0},null,{"$f":"Q136/$E$81","v":0},null,{"$f":"S136/$E$81","v":0},null,null,null,null,null,null,null,null,null,null,null,null,null,null,null,null,null,null,null,null,null,null,null,null,null,null,null,null,null,null,null,null,null,null,null,null,null,null,null,null,null,null,null,null,null,null,null,null,null,null,null,null,null,null,null,null,null,"SERC South",842.32899999999995,5.7000000000000002E-2,5.1999999999999998E-2,6105.0693303894068]
[null,null,"Home Electricity Usage (CO2 Equivalent)",null,{"$f":"E136/$E$82","v":0},"homes",null,null,{"$f":"I136/$E$82","v":0.62097539085961417},null,{"$f":"K136/$E$82","v":0},null,{"$f":"M136/$E$82","v":0},null,{"$f":"O136/$E$82","v":0},null,{"$f":"Q136/$E$82","v":0},null,{"$f":"S136/$E$82","v":0},null,null,null,null,null,null,null,null,null,null,null,null,null,null,null,null,null,null,null,null,null,null,null,null,null,null,null,null,null,null,null,null,null,null,null,null,null,null,null,null,null,null,null,null,null,null,null,null,null,null,null,null,null,null,null,null,null,"SERC Tennessee Valley",898.07899999999995,7.1999999999999995E-2,6.5000000000000002E-2,5337.7693505533907]
[null,null,null,null,null,null,null,null,null,null,null,null,null,null,null,null,null,null,null,null,null,null,null,null,null,null,null,null,null,null,null,null,null,null,null,null,null,null,null,null,null,null,null,null,null,null,null,null,null,null,null,null,null,null,null,null,null,null,null,null,null,null,null,null,null,null,null,null,null,null,null,null,null,null,null,null,"SERC Virginia/Carolina",593.41899999999998,6.4000000000000001E-2,6.7000000000000004E-2,4383.4268359858934]
[null,null,null,null,null,null,null,null,null,null,null,null,null,null,null,null,null,null,null,null,null,null,null,null,null,null,null,null,null,null,null,null,null,null,null,null,null,null,null,null,null,null,null,null,null,null,null,null,null,null,null,null,null,null,null,null,null,null,null,null,null,null,null,null,null,null,null,null,null,null,null,null,null,null,null,null,"Alaska Systems Coordinating Council",809.82399999999996,1.0309999999999999,1.107,5979.1122615702616]
[null,null,null,null,null,null,null,null,null,null,null,null,null,null,null,null,null,null,null,null,null,null,null,null,null,null,null,null,null,null,null,null,null,null,null,null,null,null,null,null,null,null,null,null,null,null,null,null,null,null,null,null,null,null,null,null,null,null,null,null,null,null,null,null,null,null,null,null,null,null,null,null,null,null,null,null,"Hawaiian Islands Coordinating Council",1385.1310000000001,0.55800000000000005,0.54500000000000004,8868.812105709927]
[null,null,null,null,null,null,null,null,null,null,null,null,null,null,null,null,null,null,null,null,null,null,null,null,null,null,null,null,null,null,null,null,null,null,null,null,null,null,null,null,null,null,null,null,null,null,null,null,null,null,null,null,null,null,null,null,null,null,null,null,null,null,null,null,null,null,null,null,null,null,null,null,null,null,null,null,"Midwest Reliability Organization",856.88800000000003,0.126,0.124,5038.6487144802004]
[null,null,null,null,null,null,null,null,null,null,null,null,null,null,null,null,null,null,null,null,null,null,null,null,null,null,null,null,null,null,null,null,null,null,null,null,null,null,null,null,null,null,null,null,null,null,null,null,null,null,null,null,null,null,null,null,null,null,null,null,null,null,null,null,null,null,null,null,null,null,null,null,null,null,null,null,"Northeast Power Coordinating Council",498.89600000000002,5.1999999999999998E-2,0.05,4428.3793658904206]
[null,null,null,null,null,null,null,null,null,null,null,null,null,null,null,null,null,null,null,null,null,null,null,null,null,null,null,null,null,null,null,null,null,null,null,null,null,null,null,null,null,null,null,null,null,null,null,null,null,null,null,null,null,null,null,null,null,null,null,null,null,null,null,null,null,null,null,null,null,null,null,null,null,null,null,null,"Reliability First Corporation",825.21799999999996,6.7000000000000004E-2,5.7000000000000002E-2,5506.8829294970392]
[null,null,null,null,null,null,null,null,null,null,null,null,null,null,null,null,null,null,null,null,null,null,null,null,null,null,null,null,null,null,null,null,null,null,null,null,null,null,null,null,null,null,null,null,null,null,null,null,null,null,null,null,null,null,null,null,null,null,null,null,null,null,null,null,null,null,null,null,null,null,null,null,null,null,null,null,"SERC Reliability Corporation",801.28899999999999,6.7000000000000004E-2,6.2E-2,5610.572615267989]
[null,null,null,null,null,null,null,null,null,null,null,null,null,null,null,null,null,null,null,null,null,null,null,null,null,null,null,null,null,null,null,null,null,null,null,null,null,null,null,null,null,null,null,null,null,null,null,null,null,null,null,null,null,null,null,null,null,null,null,null,null,null,null,null,null,null,null,null,null,null,null,null,null,null,null,null,"Texas Regional Entity",{"$f":"AF93","v":733.90200000000004},8.6999999999999994E-2,8.5999999999999993E-2,5105.9902522997809]
[null,null,null,null,null,null,null,null,null,null,null,null,null,null,null,null,null,null,null,null,null,null,null,null,null,null,null,null,null,null,null,null,null,null,null,null,null,null,null,null,null,null,null,null,null,null,null,null,null,null,null,null,null,null,null,null,null,null,null,null,null,null,null,null,null,null,null,null,null,null,null,null,null,null,null,null,"Western Electricity Coordinating Council",655.27599999999995,0.10299999999999999,0.1,4453.3997675900155]
[]
[]
[null,null,null,null,null,null,null,null,null,null,null,null,null,null,null,null,null,null,null,null,null,null,null,null,null,null,null,null,null,null,null,null,null,null,null,null,null,null,null,null,null,null,null,null,null,null,null,null,null,null,null,null,null,null,null,null,null,null,null,null,null,null,null,null,null,null,null,null,null,null,null,null,null,null,null,null,"ASCC Alaska Grid_Fossil",{"$f":"AM61","v":1074.068},{"$f":"AL61","v":0.36699999999999999},{"$f":"AK61","v":6.6310000000000002},{"$f":"BA61","v":8073.6353581267495}]
[null,null,null,null,null,null,null,null,null,null,null,null,null,null,null,null,null,null,null,null,null,null,null,null,null,null,null,null,null,null,null,null,null,null,null,null,null,null,null,null,null,null,null,null,null,null,null,null,null,null,null,null,null,null,null,null,null,null,null,null,null,null,null,null,null,null,null,null,null,null,null,null,null,null,null,null,"ASCC Miscellaneous_Fossil",{"$f":"AM62","v":1656.6659999999999},{"$f":"AL62","v":2.2549999999999999},{"$f":"AK62","v":25.853999999999999},{"$f":"BA62","v":11105.249600671403}]
[null,null,null,null,null,null,null,null,null,null,null,null,null,null,null,null,null,null,null,null,null,null,null,null,null,null,null,null,null,null,null,null,null,null,null,null,null,null,null,null,null,null,null,null,null,null,null,null,null,null,null,null,null,null,null,null,null,null,null,null,null,null,null,null,null,null,null,null,null,null,null,null,null,null,null,null,"WECC Southwest_Fossil",1173.527,0.16900000000000001,0.58699999999999997,8438.2817128615843]
[null,null,null,null,null,null,null,null,null,null,null,null,null,null,null,null,null,null,null,null,null,null,null,null,null,null,null,null,null,null,null,null,null,null,null,null,null,null,null,null,null,null,null,null,null,null,null,null,null,null,null,null,null,null,null,null,null,null,null,null,null,null,null,null,null,null,null,null,null,null,null,null,null,null,null,null,"WECC California_Fossil",931.57600000000002,2.4E-2,0.60299999999999998,8101.8128552197359]
[null,null,null,null,null,null,null,null,null,null,null,null,null,null,null,null,null,null,null,null,null,null,null,null,null,null,null,null,null,null,null,null,null,null,null,null,null,null,null,null,null,null,null,null,null,null,null,null,null,null,null,null,null,null,null,null,null,null,null,null,null,null,null,null,null,null,null,null,null,null,null,null,null,null,null,null,"ERCOT All_Fossil",1176.912,0.51200000000000001,0.71299999999999997,8159.3545153329042]
[null,null,null,null,null,null,null,null,null,null,null,null,null,null,null,null,null,null,null,null,null,null,null,null,null,null,null,null,null,null,null,null,null,null,null,null,null,null,null,null,null,null,null,null,null,null,null,null,null,null,null,null,null,null,null,null,null,null,null,null,null,null,null,null,null,null,null,null,null,null,null,null,null,null,null,null,"FRCC All_Fossil",945.99900000000002,0.11,0.215,7698.4907797508786]
[null,null,null,null,null,null,null,null,null,null,null,null,null,null,null,null,null,null,null,null,null,null,null,null,null,null,null,null,null,null,null,null,null,null,null,null,null,null,null,null,null,null,null,null,null,null,null,null,null,null,null,null,null,null,null,null,null,null,null,null,null,null,null,null,null,null,null,null,null,null,null,null,null,null,null,null,"HICC Miscellaneous_Fossil",1617.308,6.4909999999999997,10.903,11186.819236050076]
[null,null,null,null,null,null,null,null,null,null,null,null,null,null,null,null,null,null,null,null,null,null,null,null,null,null,null,null,null,null,null,null,null,null,null,null,null,null,null,null,null,null,null,null,null,null,null,null,null,null,null,null,null,null,null,null,null,null,null,null,null,null,null,null,null,null,null,null,null,null,null,null,null,null,null,null,"HICC Oahu_Fossil",1661.123,4.9710000000000001,4.3890000000000002,11034.700623612154]
[null,null,null,null,null,null,null,null,null,null,null,null,null,null,null,null,null,null,null,null,null,null,null,null,null,null,null,null,null,null,null,null,null,null,null,null,null,null,null,null,null,null,null,null,null,null,null,null,null,null,null,null,null,null,null,null,null,null,null,null,null,null,null,null,null,null,null,null,null,null,null,null,null,null,null,null,"MRO East_Fossil",1664.682,0.27800000000000002,1.139,10648.903871981567]
[null,null,null,null,null,null,null,null,null,null,null,null,null,null,null,null,null,null,null,null,null,null,null,null,null,null,null,null,null,null,null,null,null,null,null,null,null,null,null,null,null,null,null,null,null,null,null,null,null,null,null,null,null,null,null,null,null,null,null,null,null,null,null,null,null,null,null,null,null,null,null,null,null,null,null,null,"MRO West_Fossil",1891.086,1.8220000000000001,1.411,10050.252089875123]
[null,null,null,null,null,null,null,null,null,null,null,null,null,null,null,null,null,null,null,null,null,null,null,null,null,null,null,null,null,null,null,null,null,null,null,null,null,null,null,null,null,null,null,null,null,null,null,null,null,null,null,null,null,null,null,null,null,null,null,null,null,null,null,null,null,null,null,null,null,null,null,null,null,null,null,null,"NPCC New England_Fossil",852.01099999999997,2.5999999999999999E-2,0.22700000000000001,8421.3893169146741]
[null,null,null,null,null,null,null,null,null,null,null,null,null,null,null,null,null,null,null,null,null,null,null,null,null,null,null,null,null,null,null,null,null,null,null,null,null,null,null,null,null,null,null,null,null,null,null,null,null,null,null,null,null,null,null,null,null,null,null,null,null,null,null,null,null,null,null,null,null,null,null,null,null,null,null,null,"WECC Northwest_Fossil",1515.2719999999999,0.61099999999999999,1.3089999999999999,9542.1634291893788]
[null,null,null,null,null,null,null,null,null,null,null,null,null,null,null,null,null,null,null,null,null,null,null,null,null,null,null,null,null,null,null,null,null,null,null,null,null,null,null,null,null,null,null,null,null,null,null,null,null,null,null,null,null,null,null,null,null,null,null,null,null,null,null,null,null,null,null,null,null,null,null,null,null,null,null,null,"NPCC NYC/Westchester_Fossil",862.98,6.0000000000000001E-3,0.20399999999999999,7331.8480438616944]
[null,null,null,null,null,null,null,null,null,null,null,null,null,null,null,null,null,null,null,null,null,null,null,null,null,null,null,null,null,null,null,null,null,null,null,null,null,null,null,null,null,null,null,null,null,null,null,null,null,null,null,null,null,null,null,null,null,null,null,null,null,null,null,null,null,null,null,null,null,null,null,null,null,null,null,null,"NPCC Long Island_Fossil",1117.979,4.3999999999999997E-2,0.54200000000000004,10683.012352238007]
[null,null,null,null,null,null,null,null,null,null,null,null,null,null,null,null,null,null,null,null,null,null,null,null,null,null,null,null,null,null,null,null,null,null,null,null,null,null,null,null,null,null,null,null,null,null,null,null,null,null,null,null,null,null,null,null,null,null,null,null,null,null,null,null,null,null,null,null,null,null,null,null,null,null,null,null,"NPCC Upstate NY_Fossil",914.08799999999997,4.2999999999999997E-2,0.219,8516.6017394812898]
[null,null,null,null,null,null,null,null,null,null,null,null,null,null,null,null,null,null,null,null,null,null,null,null,null,null,null,null,null,null,null,null,null,null,null,null,null,null,null,null,null,null,null,null,null,null,null,null,null,null,null,null,null,null,null,null,null,null,null,null,null,null,null,null,null,null,null,null,null,null,null,null,null,null,null,null,"RFC East_Fossil",981.029,0.29799999999999999,0.27,7920.3670617086527]
[null,null,null,null,null,null,null,null,null,null,null,null,null,null,null,null,null,null,null,null,null,null,null,null,null,null,null,null,null,null,null,null,null,null,null,null,null,null,null,null,null,null,null,null,null,null,null,null,null,null,null,null,null,null,null,null,null,null,null,null,null,null,null,null,null,null,null,null,null,null,null,null,null,null,null,null,"RFC Michigan_Fossil",1230.8489999999999,0.70399999999999996,0.62,8747.6642958183074]
[null,null,null,null,null,null,null,null,null,null,null,null,null,null,null,null,null,null,null,null,null,null,null,null,null,null,null,null,null,null,null,null,null,null,null,null,null,null,null,null,null,null,null,null,null,null,null,null,null,null,null,null,null,null,null,null,null,null,null,null,null,null,null,null,null,null,null,null,null,null,null,null,null,null,null,null,"RFC West_Fossil",1426.364,0.64900000000000002,0.65100000000000002,8794.5567686797403]
[null,null,null,null,null,null,null,null,null,null,null,null,null,null,null,null,null,null,null,null,null,null,null,null,null,null,null,null,null,null,null,null,null,null,null,null,null,null,null,null,null,null,null,null,null,null,null,null,null,null,null,null,null,null,null,null,null,null,null,null,null,null,null,null,null,null,null,null,null,null,null,null,null,null,null,null,"WECC Rockies_Fossil",1783.758,0.56599999999999995,0.89700000000000002,10256.375599265259]
[null,null,null,null,null,null,null,null,null,null,null,null,null,null,null,null,null,null,null,null,null,null,null,null,null,null,null,null,null,null,null,null,null,null,null,null,null,null,null,null,null,null,null,null,null,null,null,null,null,null,null,null,null,null,null,null,null,null,null,null,null,null,null,null,null,null,null,null,null,null,null,null,null,null,null,null,"SPP North_Fossil",1880.77,0.29899999999999999,1.0069999999999999,10355.093157007748]
[null,null,null,null,null,null,null,null,null,null,null,null,null,null,null,null,null,null,null,null,null,null,null,null,null,null,null,null,null,null,null,null,null,null,null,null,null,null,null,null,null,null,null,null,null,null,null,null,null,null,null,null,null,null,null,null,null,null,null,null,null,null,null,null,null,null,null,null,null,null,null,null,null,null,null,null,"SPP South_Fossil",1380.0060000000001,1.0049999999999999,1.0349999999999999,9487.876013551655]
[null,null,null,null,null,null,null,null,null,null,null,null,null,null,null,null,null,null,null,null,null,null,null,null,null,null,null,null,null,null,null,null,null,null,null,null,null,null,null,null,null,null,null,null,null,null,null,null,null,null,null,null,null,null,null,null,null,null,null,null,null,null,null,null,null,null,null,null,null,null,null,null,null,null,null,null,"SERC Mississippi Valley_Fossil",1002.079,0.45200000000000001,0.64500000000000002,7562.5705361169294]
[null,null,null,null,null,null,null,null,null,null,null,null,null,null,null,null,null,null,null,null,null,null,null,null,null,null,null,null,null,null,null,null,null,null,null,null,null,null,null,null,null,null,null,null,null,null,null,null,null,null,null,null,null,null,null,null,null,null,null,null,null,null,null,null,null,null,null,null,null,null,null,null,null,null,null,null,"SERC Midwest_Fossil",1811.875,2.39,1.149,9585.6416928604467]
[null,null,null,null,null,null,null,null,null,null,null,null,null,null,null,null,null,null,null,null,null,null,null,null,null,null,null,null,null,null,null,null,null,null,null,null,null,null,null,null,null,null,null,null,null,null,null,null,null,null,null,null,null,null,null,null,null,null,null,null,null,null,null,null,null,null,null,null,null,null,null,null,null,null,null,null,"SERC South_Fossil",1203.3889999999999,0.121,0.438,8706.5456840200823]
[null,null,null,null,null,"Map of NERC Regions",null,null,null,null,null,null,null,null,null,null,null,null,null,null,null,null,null,null,null,null,null,null,null,null,null,null,null,null,null,null,null,null,null,null,null,null,null,null,null,null,null,null,null,null,null,null,null,null,null,null,null,null,null,null,null,null,null,null,null,null,null,null,null,null,null,null,null,null,null,null,"SERC Tennessee Valley_Fossil",1558.384,0.71699999999999997,0.64500000000000002,9191.9499184891447]
[null,null,null,null,null,null,null,null,null,null,null,null,null,null,null,null,null,null,null,null,null,null,null,null,null,null,null,null,null,null,null,null,null,null,null,null,null,null,null,null,null,null,null,null,null,null,null,null,null,null,null,null,null,null,null,null,null,null,null,null,null,null,null,null,null,null,null,null,null,null,null,null,null,null,null,null,"SERC Virginia/Carolina_Fossil",1177.4090000000001,0.24299999999999999,0.51,8761.2279661896464]
[null,null,null,null,null,null,null,null,null,null,null,null,null,null,null,null,null,null,null,null,null,null,null,null,null,null,null,null,null,null,null,null,null,null,null,null,null,null,null,null,null,null,null,null,null,null,null,null,null,null,null,null,null,null,null,null,null,null,null,null,null,null,null,null,null,null,null,null,null,null,null,null,null,null,null,null,"Alaska Systems Coordinating Council_Fossil",1134.6969999999999,0.56299999999999994,8.6310000000000002,8386.5182655642075]
[null,null,null,null,null,null,null,null,null,null,null,null,null,null,null,null,null,null,null,null,null,null,null,null,null,null,null,null,null,null,null,null,null,null,null,null,null,null,null,null,null,null,null,null,null,null,null,null,null,null,null,null,null,null,null,null,null,null,null,null,null,null,null,null,null,null,null,null,null,null,null,null,null,null,null,null,"Hawaiian Islands Coordinating Council_Fossil",1650.194,5.35,6.0140000000000002,11070.39638190699]
[null,null,null,null,null,null,null,null,null,null,null,null,null,null,null,null,null,null,null,null,null,null,null,null,null,null,null,null,null,null,null,null,null,null,null,null,null,null,null,null,null,null,null,null,null,null,null,null,null,null,null,null,null,null,null,null,null,null,null,null,null,null,null,null,null,null,null,null,null,null,null,null,null,null,null,null,"Midwest Reliability Organization_Fossil",1676.509,1.2390000000000001,1.206,9872.4613553083655]
[null,null,null,null,null,null,null,null,null,null,null,null,null,null,null,null,null,null,null,null,null,null,null,null,null,null,null,null,null,null,null,null,null,null,null,null,null,null,null,null,null,null,null,null,null,null,null,null,null,null,null,null,null,null,null,null,null,null,null,null,null,null,null,null,null,null,null,null,null,null,null,null,null,null,null,null,"Northeast Power Coordinating Council_Fossil",893.50699999999995,2.5999999999999999E-2,0.25,8421.2198415447074]
[null,null,null,null,null,null,null,null,null,null,null,null,null,null,null,null,null,null,null,null,null,null,null,null,null,null,null,null,null,null,null,null,null,null,null,null,null,null,null,null,null,null,null,null,null,null,null,null,null,null,null,null,null,null,null,null,null,null,null,null,null,null,null,null,null,null,null,null,null,null,null,null,null,null,null,null,"Reliability First Corporation_Fossil",1269.8219999999999,0.55000000000000004,0.53800000000000003,8517.1779447277586]
[null,null,null,null,null,null,null,null,null,null,null,null,null,null,null,null,null,null,null,null,null,null,null,null,null,null,null,null,null,null,null,null,null,null,null,null,null,null,null,null,null,null,null,null,null,null,null,null,null,null,null,null,null,null,null,null,null,null,null,null,null,null,null,null,null,null,null,null,null,null,null,null,null,null,null,null,"SERC Reliability Corporation_Fossil",1207.9570000000001,0.47099999999999997,0.52700000000000002,8453.2532088975549]
[null,null,null,null,null,null,null,null,null,null,null,null,null,null,null,null,null,null,null,null,null,null,null,null,null,null,null,null,null,null,null,null,null,null,null,null,null,null,null,null,null,null,null,null,null,null,null,null,null,null,null,null,null,null,null,null,null,null,null,null,null,null,null,null,null,null,null,null,null,null,null,null,null,null,null,null,"Texas Regional Entity_Fossil",1181.2059999999999,0.51900000000000002,0.71899999999999997,8170.3712689349022]
[null,null,null,null,null,null,null,null,null,null,null,null,null,null,null,null,null,null,null,null,null,null,null,null,null,null,null,null,null,null,null,null,null,null,null,null,null,null,null,null,null,null,null,null,null,null,null,null,null,null,null,null,null,null,null,null,null,null,null,null,null,null,null,null,null,null,null,null,null,null,null,null,null,null,null,null,"Western Electricity Coordinating Council_Fossil",1323.4690000000001,0.34599999999999997,0.86899999999999999,8985.5994987262893]
[]
[]
[]
[null,null,null,null,null,null,null,null,null,null,null,null,null,null,null,null,null,null,null,null,null,null,null,null,null,null,null,null,null,null,null,null,null,null,null,null,null,null,null,null,null,null,null,null,null,null,null,null,null,null,null,null,null,null,null,null,null,null,null,null,null,null,null,null,null,null,null,null,null,null,null,null,null,null,null,null,"Canada Average",{"$f":"BT9","v":220.46244201837774},{"$f":"BV9","v":1.1415078610552385},{"$f":"BU9","v":0.71691578453630334},{"$f":"BW9","v":3634}]
[null,null,null,null,null,null,null,null,null,null,null,null,null,null,null,null,null,null,null,null,null,null,null,null,null,null,null,null,null,null,null,null,null,null,null,null,null,null,null,null,null,null,null,null,null,null,null,null,null,null,null,null,null,null,null,null,null,null,null,null,null,null,null,null,null,null,null,null,null,null,null,null,null,null,null,null,"Alberta",1410.56,{"$f":"BV10","v":3.9072900352729905},{"$f":"BU10","v":2.8677163722195678},12388]
[null,null,null,null,null,null,null,null,null,null,null,null,null,null,null,null,null,null,null,null,null,null,null,null,null,null,null,null,null,null,null,null,null,null,null,null,null,null,null,null,null,null,null,null,null,null,null,null,null,null,null,null,null,null,null,null,null,null,null,null,null,null,null,null,null,null,null,null,null,null,null,null,null,null,null,null,"British Columbia",{"$f":"BT11","v":30.864741882572886},{"$f":"BV11","v":5.4314629705916077E-3},{"$f":"BU11","v":8.1796389488258042E-2},{"$f":"BW11","v":437}]
[null,null,null,null,null,null,null,null,null,null,null,null,null,null,null,null,null,null,null,null,null,null,null,null,null,null,null,null,null,null,null,null,null,null,null,null,null,null,null,null,null,null,null,null,null,null,null,null,null,null,null,null,null,null,null,null,null,null,null,null,null,null,null,null,null,null,null,null,null,null,null,null,null,null,null,null,"Manitoba",{"$f":"BT12","v":2.866011746238911},{"$f":"BV12","v":4.1752211078894916E-2},{"$f":"BU12","v":2.7766635200966863E-2},{"$f":"BW12","v":300}]
[null,null,null,null,null,null,null,null,null,null,null,null,null,null,null,null,null,null,null,null,null,null,null,null,null,null,null,null,null,null,null,null,null,null,null,null,null,null,null,null,null,null,null,null,null,null,null,null,null,null,null,null,null,null,null,null,null,null,null,null,null,null,null,null,null,null,null,null,null,null,null,null,null,null,null,null,"New Brunswick",1237,{"$f":"BV13","v":0.95781963183094909},{"$f":"BU13","v":1.3788610465998909},7582]
[]
[null,null,null,null,null,null,null,null,null,null,null,null,null,null,null,null,null,null,null,null,null,null,null,null,null,null,null,null,null,null,null,null,null,null,null,null,null,null,null,null,null,null,null,null,null,null,null,null,null,null,null,null,null,null,null,null,null,null,null,null,null,null,null,null,null,null,null,null,null,null,null,null,null,null,null,null,"Newfoundland",{"$f":"BT14","v":37.478615143124216},{"$f":"BV14","v":0.16350828464116218},{"$f":"BU14","v":0.17452509934638943},{"$f":"BW14","v":365}]
[null,null,null,null,null,null,null,null,null,null,null,null,null,null,null,null,null,null,null,null,null,null,null,null,null,null,null,null,null,null,null,null,null,null,null,null,null,null,null,null,null,null,null,null,null,null,null,null,null,null,null,null,null,null,null,null,null,null,null,null,null,null,null,null,null,null,null,null,null,null,null,null,null,null,null,null,"Nova Scotia",1582.9,12.577127550484972,3.5648859805102604,7980]
[null,null,null,null,null,null,null,null,null,null,null,null,null,null,null,null,null,null,null,null,null,null,null,null,null,null,null,null,null,null,null,null,null,null,null,null,null,null,null,null,null,null,null,null,null,null,null,null,null,null,null,null,null,null,null,null,null,null,null,null,null,null,null,null,null,null,null,null,null,null,null,null,null,null,null,null,"Ontario",876,0.17477172909733199,0.27722551473506435,7582]
[null,null,null,null,null,null,null,null,null,null,null,null,null,null,null,null,null,null,null,null,null,null,null,null,null,null,null,null,null,null,null,null,null,null,null,null,null,null,null,null,null,null,null,null,null,null,null,null,null,null,null,null,null,null,null,null,null,null,null,null,null,null,null,null,null,null,null,null,null,null,null,null,null,null,null,null,"Prince Edward Island",{"$f":"BT17","v":4.4092488403675549},0.29408376138211373,0.12027277524390242,{"$f":"BW17","v":7864}]
[null,null,null,null,null,null,null,null,null,null,null,null,null,null,null,null,null,null,null,null,null,null,null,null,null,null,null,null,null,null,null,null,null,null,null,null,null,null,null,null,null,null,null,null,null,null,null,null,null,null,null,null,null,null,null,null,null,null,null,null,null,null,null,null,null,null,null,null,null,null,null,null,null,null,null,null,"Quebec",{"$f":"BT18","v":2.6455493042205331},2.0214579782354802E-2,0.1030691903875308,{"$f":"BW18","v":101}]
[null,null,null,null,null,null,null,null,null,null,null,null,null,null,null,null,null,null,null,null,null,null,null,null,null,null,null,null,null,null,null,null,null,null,null,null,null,null,null,null,null,null,null,null,null,null,null,null,null,null,null,null,null,null,null,null,null,null,null,null,null,null,null,null,null,null,null,null,null,null,null,null,null,null,null,null,"Saskatchewan",{"$f":"BT19","v":1388.9133847157798},9.7426139480127194,3.9008768784703931,{"$f":"BW19","v":5711}]
[]
[null,null,null,null,null,null,null,null,null,null,null,null,null,null,null,null,null,null,null,null,null,null,null,null,null,null,null,null,null,null,null,null,null,null,null,null,null,null,null,null,null,null,null,null,null,null,null,null,null,null,null,null,null,null,null,null,null,null,null,null,null,null,null,null,null,null,null,null,null,null,null,null,null,null,null,null,null,"CO2 Emission Rate (lb/MWh)","SO2 Emission Rate (lb/MWh)","NOX Emission Rate (lb/MWh)","Annual Heat Rate (Btu/kWh)"]
[null,null,null,null,null,null,null,null,null,null,null,null,null,null,null,null,null,null,null,null,null,null,null,null,null,null,null,null,null,null,null,null,null,null,null,null,null,null,null,null,null,null,null,null,null,null,null,null,null,null,null,null,null,null,null,null,null,null,null,null,null,null,null,null,null,null,null,null,null,null,null,null,null,null,null,null,"**Ontario #'s replaced to include Marginal Power Mix as provided by Enbridge Gas on 8/14/16, then updated NB and NS per Enbridge on 9/13/16"]
[null,null,null,null,null,null,null,null,null,null,null,null,null,null,null,null,null,null,null,null,null,null,null,null,null,null,null,null,null,null,null,null,null,null,null,null,null,null,null,null,null,null,null,null,null,null,null,null,null,null,null,null,null,null,null,null,null,null,null,null,null,null,null,null,null,null,null,null,null,null,null,null,null,null,null,null,"Orig Ontario All source",216.1,null,null,2686]
[null,null,null,null,null,null,null,null,null,null,null,null,null,null,null,null,null,null,null,null,null,null,null,null,null,null,null,null,null,null,null,null,null,null,null,null,null,null,null,null,null,null,null,null,null,null,null,null,null,null,null,null,null,null,null,null,null,null,null,null,null,null,null,null,null,null,null,null,null,null,null,null,null,null,null,null,"Orig New Brunswick",976.6,null,null,2720]
[null,null,null,null,null,null,null,null,null,null,null,null,null,null,null,null,null,null,null,null,null,null,null,null,null,null,null,null,null,null,null,null,null,null,null,null,null,null,null,null,null,null,null,null,null,null,null,null,null,null,null,null,null,null,null,null,null,null,null,null,null,null,null,null,null,null,null,null,null,null,null,null,null,null,null,null,"Nova Scotia","1582.9 (no change)",null,null,"Changed"]
[null,null,null,null,null,null,null,null,null,null,null,null,null,null,null,null,null,null,null,null,null,null,null,null,null,null,null,null,null,null,null,null,null,null,null,null,null,null,null,null,null,null,null,null,null,null,null,null,null,null,null,null,null,null,null,null,null,null,null,null,null,null,null,null,null,null,null,null,null,null,null,null,null,null,null,null,"Alberta",1629.2,null,null,10177]
[null,null,null,null,null,null,null,null,null,null,null,null,null,null,null,null,null,null,null,null,null,null,null,null,null,null,null,null,null,null,null,null,null,null,null,null,null,null,null,null,null,null,null,null,null,null,null,null,null,null,null,null,null,null,null,null,null,null,null,null,null,null,null,null,null,null,null,null,null,null,null,null,null,null,null,null,"Orig formulas >>>> (alberta example)",{"$f":"BT85","v":0},{"$f":"BV85","v":0},{"$f":"BU85","v":0},{"$f":"BW85","v":0}]
[null,null,null,null,null,null,null,null,null,null,null,null,null,null,null,null,null,null,null,null,null,null,null,null,null,null,null,null,null,null,null,null,null,null,null,null,null,null,null,null,null,null,null,null,null,null,null,null,null,null,null,null,null,null,null,null,null,null,null,null,null,null,null,null,null,null,null,null,null,null,null,null,null,null,null,null,"…for other provinces"]
[null,null,null,null,null,null,null,null,null,null,null,null,null,null,null,null,null,null,null,null,null,null,null,null,null,null,null,null,null,null,null,null,null,null,null,null,null,null,null,null,null,null,null,null,null,null,null,null,null,null,null,null,null,null,null,null,null,null,null,null,null,null,null,null,null,null,null,null,null,null,null,null,null,null,null,null,"** update cels F25 and E26 for notes on marginal mix"]

{"sheet":"Profiles","index":9,"n_rows":2,"n_cols":5,"rows_kept":2,"cut":false,"hidden":false,"merged":[]}
["Displaced Electricity"]
[null,{"$f":"LOOKUP('User Input'!$F$5,Lists!A21:A83,Lists!C21:C83)","v":"US"},"State/Province",null,"*need to keep for HSPF and heating load"]

{"sheet":"Methodology","index":10,"n_rows":1,"n_cols":1,"rows_kept":1,"cut":false,"hidden":false,"merged":[]}
["Residential Energy Cost & Emissions Tool – 2025 Methodology"]