{"text_format":"1","workbook":"xlsx","n_sheets":11,"sheets":["User Input","Lists","Heating Load","Adjusted HSPF","AppTech","Factors","Residential Prices","Calc","Carbon Calculator","Profiles","Methodology"],"not_rendered":{"charts":6,"images":2,"macros":0,"external_links":0,"defined_names":45,"comments":3,"pivot_tables":0},"unopened":[],"bounds":{"document_bytes":16777216,"sheet_cells":100000,"rows_first":2000,"rows_last":500,"rows_between":2000,"halvings":0,"cell_chars":16384,"cell_head_chars":4096},"cells_cut":0,"cells_raw":0,"read":"whole","date_system":"1900"}

{"sheet":"User Input","index":0,"n_rows":95,"n_cols":15,"rows_kept":95,"cut":false,"hidden":false,"merged":[[12,5,12,6],[66,11,66,13]]}
[]
[]
[null,null,null,"Residential Energy Cost & Emissions Calculator"]
[]
[null,null,null,null,"State/Province",1,null,null,"Includes eGrid 2025 update (2023 data)"]
[]
[null,null,null,null,"City (for U.S. states)",1]
[]
[null,null,null,null,"Central Station Emissions Profile",2,null,null,{"$f":"IFERROR(_xlfn.IFS(AND(state<53,emisProfile=3),\"Central Station Emissions Profile does not match.\",AND(state>52,emisProfile<3),\"Central Station Emissions Profile does not match.\"),\"\")","v":""}]
[]
{"$rows_left_out":86}
{"sheet":"Lists","index":1,"n_rows":358,"n_cols":13,"rows_kept":358,"cut":false,"hidden":false,"merged":[[117,8,117,9]]}
["Pick list lookups",null,null,null,null,null,null,"*lists below update based on fuel type"]
[]
["A1","Furnace technology",null,null,null,null,null,"Type of Heating System to Compare",null,"Dryer/Cooking Types"]
[1,"Average Furnace (AFUE 80%)",0.8,null,null,null,1,"Electric",1,"Electric"]
[2,"High Efficiency Furnace (AFUE 92%)",0.92,null,null,null,2,"Oil",2,"Propane"]
[3,"Ultra High Effic. Furnace (AFUE 97%)",0.97,null,null,null,3,"Propane",3,"Gas"]
[4,"Standard Boiler (AFUE 82%)",0.82,null,null,null,4,"Gas"]
[5,"Condensing Boiler (AFUE 92%)",0.92,null,null,null,"Space",{"$f":"CHOOSE(heattype, \"Electric\", \"Oil\", \"Propane\", \"Gas\")","v":"Electric"}]
[6,"Wall Hung Boiler (AFUE 96%)",0.96,null,null,null,"Water",{"$f":"CHOOSE(wheattype, \"Electric\", \"Oil\", \"Propane\", \"Gas\")","v":"Electric"}]
[7,"Gas Heat Pump (COP 1.4)",1.4,null,null,null,null," "]
{"$rows_left_out":349}
{"sheet":"Heating Load","index":2,"n_rows":243,"n_cols":11,"rows_kept":243,"cut":false,"hidden":false,"merged":[]}
[null,null,null,"Heat Load","2,000 sqft","3,000 sqft","4,000 sqft","slope","intercept",null,"Selected sqft"]
[null,{"$f":"activestate","v":"US"},{"$f":"LOOKUP(city,Lists!G119:G133,Lists!H119:H133)","v":""},null,{"$f":"VLOOKUP(1,B4:E243,4,0)","v":49.469595263157885},{"$f":"VLOOKUP(1,B4:F243,5,0)","v":65.263807999999955},{"$f":"VLOOKUP(1,B4:G243,6,0)","v":80.04382378947372},{"$f":"SLOPE(E2:G2,homesize)","v":1.5287114263157917E-2},{"$f":"INTERCEPT(E2:G2,homesize)","v":19.064399561403434},null,{"$f":"(sqft*H2)+I2","v":49.638628087719269}]
[null,"Active","State","City","Total Heating Load MMBtu (2000 sqft)","Total Heating Load MMBtu (3000 sqft)","Total Heating Load MMBtu (4000 sqft)"]
[1,{"$f":"IF(C4=activestate,IF(D4=C$2,1,0),0)","v":0},"AK","Anchorage",89.101272000000009,117.44049599999998,144.55022399999999]
[2,0,"AK","Annette",52.489176,68.840400000000002,84.332808]
[3,0,"AK","Bethel",130.026096,173.18315999999999,213.789072]
[4,0,"AK","Big Delta",130.79267999999999,173.33462399999999,212.44766400000003]
[5,0,"AK","Cold Bay",90.597239999999999,119.39068800000001,145.48883999999998]
[6,0,"AK","Fairbanks",138.521424,182.28103200000001,225.53659200000004]
[7,0,"AK","Gulkana",125.008488,164.884896,203.18772000000001]
{"$rows_left_out":234}
{"sheet":"Adjusted HSPF","index":3,"n_rows":246,"n_cols":14,"rows_kept":246,"cut":false,"hidden":false,"merged":[[3,4,3,6],[4,4,4,6]]}
[null,null,null,"HSPF","7.5 HSPF2","7.8 HSPF2","9 HSPF2"]
[null,{"$f":"activestate","v":"US"},{"$f":"LOOKUP(city,Lists!G119:G133,Lists!H119:H133)","v":""},null,{"$f":"VLOOKUP(1,B7:E246,4,0)","v":6.7278185050535928},{"$f":"VLOOKUP(1,B7:F246,5,0)","v":6.8949319540895111},{"$f":"VLOOKUP(1,B7:G246,6,0)","v":7.6689391992691007}]
[null,null,null,null,null,null,null,null,null,"*values in row 6 are calculated HSPF based on HSPF2 values in row 1"]
[null,null,null,null,"  Adjusted HSPF when"]
[null,null,null,null,"      rated HSPF is:"]
[null,null,"State","City",8.8000000000000007,9.1,10.6,"ASHRAE Design Temp",null,null,"HSPF2",7.5,7.8,9]
[1,{"$f":"IF(C7=activestate,IF(D7='Heating Load'!C$2,1,0),0)","v":0},"AK","Anchorage",{"$f":"+E$6-(E$6*((0.1392+(-0.00846*$H7)+(-0.0001074*$H7^2)+(0.0228*E$6))))","v":5.15944},{"$f":"+F$6-(F$6*((0.1392+(-0.00846*$H7)+(-0.0001074*$H7^2)+(0.0228*F$6))))","v":5.2730859999999993},5.7797559999999999,-10,null,null,"HSPF",{"$f":"L6/0.85","v":8.8235294117647065},{"$f":"M6/0.85","v":9.1764705882352935},10.588235294117647]
[2,{"$f":"IF(C8=activestate,IF(D8='Heating Load'!C$2,1,0),0)","v":0},"AK","Annette",7.3481636800000008,7.5364252599999997,8.4161731599999996,17]
[3,{"$f":"IF(C9=activestate,IF(D9='Heating Load'!C$2,1,0),0)","v":0},"AK","Bethel",4.5670451200000004,4.6604958399999994,5.0661894399999996,-24]
[4,{"$f":"IF(C10=activestate,IF(D10='Heating Load'!C$2,1,0),0)","v":0},"AK","Big Delta",4.3434635200000002,4.4292921399999994,4.7968752399999994,-39]
{"$rows_left_out":237}
{"sheet":"AppTech","index":4,"n_rows":53,"n_cols":8,"rows_kept":53,"cut":false,"hidden":false,"merged":[]}
["Appliance Technologies"]
[]
["Furnace","Selected"]
[null,"Technology"]
[null,{"$f":"furntype","v":1},1,2,3,4,5]
[null,{"$f":"LOOKUP(B$5,C$5:R$5,C6:R6)","v":"Average Furnace"},"Average Furnace","High Efficiency Furnace","Condensing Furnace","Standard Boiler","Condensing Boiler"]
["Capacity (RT)",{"$f":"LOOKUP(B$5,C$5:R$5,C7:R7)","v":0}]
["CapLow (RT)",{"$f":"LOOKUP(B$5,C$5:R$5,C8:R8)","v":38000},38000,38000,38000,38000,38000]
["CapHigh (RT)",{"$f":"LOOKUP(B$5,C$5:R$5,C9:R9)","v":128000},128000,128000,128000,128000,128000]
[]
{"$rows_left_out":44}
{"sheet":"Factors","index":5,"n_rows":29,"n_cols":8,"rows_kept":29,"cut":false,"hidden":false,"merged":[[16,0,16,1]]}
["Factors"]
[]
["General Emission Factors"]
[{"$f":"12/44","v":0.27272727272727271},null,"ratio of carbon to CO2"]
[{"$f":"2000/2206","v":0.90661831368993651},null,"ratio of tonnes to tons"]
[4.5999999999999996,null,"metric tons of Carbon per car",null,null,null,{"$f":"A6/11500","v":3.9999999999999996E-4},"metric tons CO2e/mile"]
[1,null,"metric tons of Carbon per acre of forest"]
[2000,null,"pounds per ton"]
[2.8299999999999999E-2,null,"ratio of cubic feet to cubic meters"]
[]
{"$rows_left_out":20}
{"sheet":"Residential Prices","index":6,"n_rows":67,"n_cols":10,"rows_kept":67,"cut":false,"hidden":false,"merged":[]}
[]
[null,"Residential Electricity, Gas, Oil, and Propane Prices"]
[]
[null,"Lookup","State or Province","Abbrev","Residential Electricity Prices: Cents per Kilowatthour","Residential Natural Gas Price ($/MMBtu)","Oil $/gal"," Propane $/gal",null,"Source (US Data):"]
[null,{"$f":"VLOOKUP(C5,Lists!$B$21:$F$83,5,0)","v":3},"Alabama","AL",14.63,19.36,4.28,3.24,null,"Average Retail Price of Electricity (2023 data)"]
[null,{"$f":"VLOOKUP(C6,Lists!$B$21:$F$83,5,0)","v":2},"Alaska","AK",23.9,10.97,4.28,2.56,null,"Retail Sales of Electricity to Ultimate Customers: Annual Data by Sector, by State, by Provider"]
[null,{"$f":"VLOOKUP(C7,Lists!$B$21:$F$83,5,0)","v":54},"Alberta","AB",19.091999999999999,9.14,4.16,3.5,null,"https://www.eia.gov/electricity/data.php"]
[null,{"$f":"VLOOKUP(C8,Lists!$B$21:$F$83,5,0)","v":5},"Arizona","AZ",14.02,18.73,4.28,2.56]
[null,{"$f":"VLOOKUP(C9,Lists!$B$21:$F$83,5,0)","v":4},"Arkansas","AR",12.25,17.21,4.28,2.38,null,"Residential Natural Gas Prices (2023 data)"]
[null,{"$f":"VLOOKUP(C10,Lists!$B$21:$F$83,5,0)","v":55},"British Columbia","BC",8.4359999999999999,9.14,4.16,3.5,null,"https://www.eia.gov/dnav/ng/ng_pri_sum_a_EPG0_PRS_DMcf_a.htm"]
{"$rows_left_out":58}
{"sheet":"Calc","index":7,"n_rows":154,"n_cols":11,"rows_kept":154,"cut":false,"hidden":false,"merged":[]}
[]
[]
[null,null,null,"Heat Type",{"$f":"heattype","v":1}]
["Space Heating",null,null,"Water Heat Type",{"$f":"wheattype","v":1}]
[]
["House Square Footage",{"$f":"sqft","v":2000}]
["NG Heating System Type",{"$f":"furntype","v":1},{"$f":"LOOKUP(B7,Lists!A4:A10,Lists!B4:B10)","v":"Average Furnace (AFUE 80%)"},null,null,"Current System"]
["NG Heating AFUE",{"$f":"_xlfn.XLOOKUP(furntype,Lists!A4:A10,Lists!C4:C10)","v":0.8},null,null,null,"Oil Heating System Type",{"$f":"_xlfn.IFS(E3=2,'User Input'!F24,E3=1,\"\",E3=3,\"\",E3=4,\"\")","v":""},{"$f":"IFERROR(_xlfn.XLOOKUP(G8,Lists!G87:G91,Oil),\"\")","v":""},"Gas Heating System Type",{"$f":"_xlfn.IFS(E3=4,'User Input'!F24,E3=1,\"\",E3=2,\"\",E3=3,\"\")","v":""},{"$f":"IFERROR(_xlfn.XLOOKUP(J8,Lists!A4:A10,Lists!B4:B10),\"\")","v":""}]
["Heating Load (MMBtu)",{"$f":"IF(sqft=0,0,heatload)","v":49.638628087719269},"MMBtu/yr",null,null,"AFUE",{"$f":"IFERROR(_xlfn.XLOOKUP(G8,Lists!G87:G91,Lists!I87:I91),\"\")","v":""},null,"AFUE",{"$f":"IFERROR(_xlfn.XLOOKUP(J8,Lists!A4:A10,Lists!C4:C10),\"\")","v":""}]
["NG Consumption (MMBtu)",{"$f":"B9/B8","v":62.048285109649086},"MMBtu/yr",null,null,"Oil Consumption (MMBtu)",{"$f":"IFERROR(B9/G9,\"\")","v":""},"MMBtu/yr","Gas Consumption",{"$f":"IFERROR(B9/J9,0)","v":0},"MMBtu/yr"]
{"$rows_left_out":145}
{"sheet":"Carbon Calculator","index":8,"n_rows":208,"n_cols":107,"rows_kept":208,"cut":false,"hidden":false,"merged":[[68,2,68,3],[68,8,68,10],[68,12,68,18],[9,8,9,18],[26,8,26,18],[34,4,39,4],[40,4,45,4],[46,4,51,4],[53,4,58,4],[67,2,67,3],[67,8,67,10],[67,12,67,18],[69,2,69,3],[69,8,69,10],[69,12,69,18],[70,2,70,3],[70,8,70,10],[70,12,70,18],[71,2,71,3],[71,8,71,10],[71,12,71,18],[72,2,72,3],[72,8,72,10],[72,12,72,18],[73,2,73,3],[73,8,73,10],[73,12,73,18],[74,2,74,3],[74,8,74,10],[74,12,74,18],[75,2,75,3],[75,8,75,10],[75,12,75,18],[76,2,76,3],[76,8,76,10],[76,12,76,18],[77,2,77,3],[77,8,77,10],[77,12,77,18],[78,2,78,3],[78,8,78,10],[78,12,78,18],[79,2,79,3],[79,8,79,10],[79,12,79,18],[80,2,80,3],[80,8,80,10],[80,12,80,19],[81,2,81,3],[81,8,81,10],[81,12,81,19],[82,2,82,3],[82,8,82,10],[82,12,82,19],[83,2,83,3],[83,8,83,10],[83,12,83,19],[84,2,84,3],[84,8,84,10],[84,12,84,18]]}
[]
[null,null,"Commercial Carbon Calculator ",null,null,null,null,null,null,null,null,null,null,null,null,null,null,null,null,null,null,"To update carbon calculator, ONLY update the table below and the table in columns BS:BW (Canada). Both are highlighted in blue"]
[null,null,null,null,null,null,null,null,null,null,null,"Developed by:"]
[null,null,null,null,null,null,null,null,null,null,null,null,null,null,null,null,null,null,null,null,null,"eGRID2023 (v2, 2025 Release), 2022 for Canada",null,null,null,null,null,null,null,null,null,null,null,null,null,null,null,null,null,null,null,null,null,null,null,null,null,null,null,null,null,null,null,null,"Canada Data",null,null,null,null,null,null,null,null,null,null,null,null,null,null,null,null,null,null,null,null,null,"Emissions Summary",null,"*values in columns BZ-CC are the ones used in calculations, but they are pulled from table starting in AF",null,null,null,null,"Other Data",null,null,null,null,null,null,null,null,null,"Lists"]
[null,null,null,null,null,null,null,null,null,null,null,null,null,null,null,null,null,null,null,null,null,null,null,null,null,null,null,null,null,null,null,null,null,null,null,null,null,null,null,null,null,null,null,null,null,null,null,null,null,null,null,null,null,null,null,null,null,null,null,null,null,null,null,null,null,null,null,null,null,null,null,null,null,null,null,null,null,null,"*only blue highlighted values are used for calcilations"]
[null,null,null,null,null,null,null,null,null,null,null,null,null,null,null,null,null,null,null,null,null,null,null,null,null,null,null,null,null,null,null,null,null,null,null,null,null,null,null,null,null,null,null,null,null,null,null,null,null,null,null,null,null,null,"CO2 Emissions",null,null,null,null,null,null,"SOX and NOX Emissions",null,null,null,null,null,null,null,null,"Canadian Average All Sources",null,null,null,null,null,"eGRID2023 US, NIR (2022) and NPRI Canada (2011)",null,null,null,null,null,null,"NOX Emission Factors, EPA AP-42 Section 1.4 Natural Gas Combustion, Table 3.4-1",null,null,null,null,null,"Unit Conversions",null,null,null,"Consumption",null,"Regions",null,null,"Emissions Profile"]
[null,null,null,null,null,null,null,null,null,null,null,null,null,null,null,null,null,null,null,null,null,"*update table below",null,null,null,null,null,null,null,null,null,null,null,null,null,null,null,null,null,null,null,null,null,null,null,null,null,null,null,null,null,null,null,null,null,null,null,null,null,null,null,null,null,null,null,null,null,null,null,null,"*update table below"]
[null,null,null,null,null,null,null,null,null,null,null,null,null,null,null,null,null,null,null,null,null,"eGRID2023 (2025 release)","State abbreviation","State nameplate capacity (MW)","State annual heat input (MMBtu)","State annual net generation (MWh)","State annual NOx emissions (tons)","State annual SO2 emissions (tons)","State annual CO2 emissions (tons)","State annual NOx total output emission rate (lb/MWh)","State annual SO2 total output emission rate (lb/MWh)","State annual CO2 total output emission rate (lb/MWh)","State annual NOx input emission rate (lb/MMBtu)","State ozone season NOx input emission rate (lb/MMBtu)","State annual SO2 input emission rate (lb/MMBtu)","State annual CO2 input emission rate (lb/MMBtu)","State annual NOx fossil fuel output emission rate (lb/MWh)","State annual SO2 fossil fuel output emission rate (lb/MWh)","State annual CO2 fossil fuel output emission rate (lb/MWh)","State annual NOx fossil fuel input emission rate (lb/MMBtu)","State annual SO2 fossil fuel input emission rate (lb/MMBtu)","State annual CO2 fossil fuel input emission rate (lb/MMBtu)","State annual coal net generation (MWh)","State annual oil net generation (MWh)","State annual gas net generation (MWh)","State annual other fossil net generation (MWh)","State coal generation percent (resource mix)","State oil generation percent (resource mix)","State gas generation percent (resource mix)","State other fossil  generation percent (resource mix)","State total combustion generation percent (resource mix)","Total Annual Heat Rate (Btu/kWh)","Fossil Annual Heat Rate (Btu/kWh)",null,null,"CO2 - g CO2 eq/kWh",null,"CO2 - lb CO2 eq/MWh",null,null,null,null,"SOX (t)1","NOX (t)1","SOX (pounds)","NOX (pounds)","Generation (GWh)2","SO2 output emission rate (lb/MWh)","NOX output emission rate (lb/MWh)",null,"Canada Province","2022 CO2 Emission Rate (lb/MWh)1","2011 NOX Emission Rate (lb/MWh)2","2011 SO2 Emission Rate (lb/MWh)2,3","Province Annual Heat Rate (Btu/kWh)",null,"State","CO2 Emission Rate (lb/MWh)","SO2 Emission Rate (lb/MWh)","NOX Emission Rate (lb/MWh)","Annual Heat Rate (Btu/kWh)",null,null,"Pollutant","# of Tests","Emission Factor (lb/106 scf)","Relative St. Dev (%)",null,null,"Value","Units",null,null,"Monthly",null,"US Average",{"$f":"CR8","v":"US Average"},1,"eGrid Subregions Ave All Sources",null,"US_Average_All_Sources","US_Average_Fossil","eGrid_Subregions_Ave_All_Sources","eGrid_Subregions_Average_Fossil","NERC_Average_All_Sources","NERC_Average_Fossil","Canadian_Average_All_Sources"]
[null,null,"User Input",null,null,null,null,null,null,null,null,null,null,null,null,null,null,null,null,null,null,"N/A","US Average",1303568.8,21889487792.688,4190970937.3569999,947487.39800000004,752518.80500000005,1607676335.9419999,0.45200000000000001,0.35899999999999999,767.20899999999995,8.6999999999999994E-2,8.2000000000000003E-2,6.9000000000000006E-2,146.88999999999999,0.71,0.56699999999999995,1270.259,8.4000000000000005E-2,6.7000000000000004E-2,149.90600000000001,674702091.56400001,23005568.559999999,1809177398.984,19169271.316,0.161,5.0000000000000001E-3,0.432,5.0000000000000001E-3,0.61399999999999999,{"$f":"Y9/Z9*1000","v":5223.0111160094129},{"$f":"Y9/(SUM(AQ9:AT9))*1000","v":8665.4857455159454},null,null,"Generation Intensity","Consumption Intensity","Generation Intensity","Consumption Intensity","Losses1",null,"Canada Average",294098.96720494935,184706.73658799267,648376465.07937539,407208165.6166203,568000,{"$f":"BM9/$BO9/1000","v":1.1415078610552385},0.71691578453630334,null,"Canada Average",220.46244201837774,0.71691578453630334,1.1415078610552385,3634,null,{"$f":"W9","v":"US Average"},{"$f":"AF9","v":767.20899999999995},{"$f":"AE9","v":0.35899999999999999},{"$f":"AD9","v":0.45200000000000001},{"$f":"AZ9","v":5223.0111160094129},null,null,"NOx (Small-Unc.)",18,104,0.51,null,null,1.1023099999999999,"short ton/metric ton",null,null,"Annual",null,"Alaska","AK",2,"eGrid Subregions Average Fossil",null,"US Average",{"$f":"CW9","v":"US Average"},"ASCC Alaska Grid","ASCC Alaska Grid","Alaska Systems Coordinating Council","Alaska Systems Coordinating Council","Canada Average"]
[null,null,null,null,null,null,null,null,"Comparison Cases",null,null,null,null,null,null,null,null,null,null,null,null,1,"AK",3095.5,39933923.741999999,6678905.1610000003,20591.981,1349.979,2704368.9870000002,6.1660000000000004,0.40400000000000003,809.82399999999996,1.0309999999999999,1.107,6.8000000000000005E-2,135.44200000000001,8.6310000000000002,0.56299999999999994,1134.6969999999999,1.0409999999999999,6.8000000000000005E-2,136.80500000000001,730681.46,848592.32499999995,3182407.1030000001,0,0.109,0.127,0.47599999999999998,0,0.71899999999999997,{"$f":"Y10/Z10*1000","v":5979.1122615702616},{"$f":"Y10/(SUM(AQ10:AT10))*1000","v":8386.5182655642075},null,"Canada Average",100,100,220.46244201837774,220.46244201837774,{"$f":"IF(BD10=0,0,BE10/BD10-1)","v":0},null,"Alberta",114491.81096,84030.117501149434,252410936.27863517,185254477.64538407,64600,3.9072900352729905,2.8677163722195678,null,"Alberta",1036.1734774863755,2.8677163722195678,3.9072900352729905,10177,null,{"$f":"W10","v":"AK"},809.82399999999996,0.40400000000000003,6.1660000000000004,5979.1122615702616,null,null,"NOx (Small-Low NOx)",5,50,0.54,null,null,9.9975999999999995E-2,"mmbtu/therm",null,null,null,null,"Alabama","AL",3,"Canadian Average All Sources",null,"Alaska","Alaska","ASCC Miscellaneous","ASCC Miscellaneous","Hawaiian Islands Coordinating Council","Hawaiian Islands Coordinating Council","Alberta"]
{"$rows_left_out":199}
{"sheet":"Profiles","index":9,"n_rows":2,"n_cols":5,"rows_kept":2,"cut":false,"hidden":false,"merged":[]}
["Displaced Electricity"]
[null,{"$f":"LOOKUP('User Input'!$F$5,Lists!A21:A83,Lists!C21:C83)","v":"US"},"State/Province",null,"*need to keep for HSPF and heating load"]

{"sheet":"Methodology","index":10,"n_rows":1,"n_cols":1,"rows_kept":1,"cut":false,"hidden":false,"merged":[]}
["Residential Energy Cost & Emissions Tool – 2025 Methodology"]